commons-dev mailing list archives

Site index · List index
Message view « Date » · « Thread »
Top « Date » · « Thread »
From Apache Continuum <...@continuum.apache.org>
Subject [continuum] BUILD FAILURE: Apache Commons JCS - Apache Commons ()
Date Tue, 13 May 2014 18:04:39 GMT
Online report : https://continuum-ci.apache.org/continuum/buildResult.action?buildId=30719&projectId=286

Build statistics:
  State: Failed
  Previous State: Failed
  Started at: Tue 13 May 2014 18:00:03 +0000
  Finished at: Tue 13 May 2014 18:04:35 +0000
  Total time: 4m 31s
  Build Trigger: Schedule
  Build Number: 1
  Exit code: 1
  Building machine hostname: continuum-vm
  Operating system : Linux(unknown)
  Java Home version : 
          java version "1.7.0_25"
          OpenJDK Runtime Environment (IcedTea 2.3.10) (7u25-2.3.10-1ubuntu0.12.04.2)
          OpenJDK 64-Bit Server VM (build 23.7-b01, mixed mode)
        
  Builder version :
          Apache Maven 3.0.5 (r01de14724cdef164cd33c7c8c2fe155faf9602da; 2013-02-19 13:51:28+0000)
          Maven home: /opt/apache-maven-3.0.5
          Java version: 1.7.0_25, vendor: Oracle Corporation
          Java home: /usr/lib/jvm/java-7-openjdk-amd64/jre
          Default locale: en_US, platform encoding: UTF-8
          OS name: "linux", version: "3.2.0-53-generic", arch: "amd64", family: "unix"
    
****************************************************************************
SCM Changes:
****************************************************************************
Changed: rmannibucau @ Tue 13 May 2014 17:03:09 +0000
Comment: fixing config (need to remove Seconds since we need milliseconds too) and expiry
for JCache (not only created time is important
Files changed:
  /commons/proper/jcs/trunk/commons-jcs-core/src/main/java/org/apache/commons/jcs/engine/ElementAttributes.java
( 1594286 )
  /commons/proper/jcs/trunk/commons-jcs-core/src/main/java/org/apache/commons/jcs/engine/control/CompositeCache.java
( 1594286 )
  /commons/proper/jcs/trunk/commons-jcs-core/src/test/conf/cache.ccf ( 1594286 )
  /commons/proper/jcs/trunk/commons-jcs-core/src/test/conf/cacheB.ccf ( 1594286 )
  /commons/proper/jcs/trunk/commons-jcs-core/src/test/conf/cacheD10A.ccf ( 1594286 )
  /commons/proper/jcs/trunk/commons-jcs-core/src/test/conf/cacheD10B.ccf ( 1594286 )
  /commons/proper/jcs/trunk/commons-jcs-core/src/test/conf/cacheID.ccf ( 1594286 )
  /commons/proper/jcs/trunk/commons-jcs-core/src/test/conf/cacheRC.ccf ( 1594286 )
  /commons/proper/jcs/trunk/commons-jcs-core/src/test/conf/cacheRCSimple.ccf ( 1594286 )
  /commons/proper/jcs/trunk/commons-jcs-core/src/test/conf/cacheRC_CEL.ccf ( 1594286 )
  /commons/proper/jcs/trunk/commons-jcs-core/src/test/conf/cacheRHTTP.ccf ( 1594286 )
  /commons/proper/jcs/trunk/commons-jcs-core/src/test/conf/remote.cache.ccf ( 1594286 )
  /commons/proper/jcs/trunk/commons-jcs-core/src/test/conf/remote.cache2.ccf ( 1594286 )
  /commons/proper/jcs/trunk/commons-jcs-core/src/test/conf/remote.cache3.ccf ( 1594286 )
  /commons/proper/jcs/trunk/commons-jcs-core/src/test/conf/remote.cacheCEL.ccf ( 1594286 )
  /commons/proper/jcs/trunk/commons-jcs-core/src/test/conf/remote.cacheCEL_CSF.ccf ( 1594286
)
  /commons/proper/jcs/trunk/commons-jcs-core/src/test/test-conf/TestARCCache.ccf ( 1594286
)
  /commons/proper/jcs/trunk/commons-jcs-core/src/test/test-conf/TestHSQLDiskCache.ccf ( 1594286
)
  /commons/proper/jcs/trunk/commons-jcs-core/src/test/test-conf/TestHSQLDiskCacheConcurrent.ccf
( 1594286 )
  /commons/proper/jcs/trunk/commons-jcs-core/src/test/test-conf/TestJDBCDiskCache.ccf ( 1594286
)
  /commons/proper/jcs/trunk/commons-jcs-core/src/test/test-conf/TestJDBCDiskCacheRemoval.ccf
( 1594286 )
  /commons/proper/jcs/trunk/commons-jcs-core/src/test/test-conf/TestJDBCDiskCacheSharedPool.ccf
( 1594286 )
  /commons/proper/jcs/trunk/commons-jcs-core/src/test/test-conf/TestJDBCDiskCacheShrink.ccf
( 1594286 )
  /commons/proper/jcs/trunk/commons-jcs-core/src/test/test-conf/TestJispDiskCache.ccf ( 1594286
)
  /commons/proper/jcs/trunk/commons-jcs-core/src/test/test-conf/TestMRUCache.ccf ( 1594286
)
  /commons/proper/jcs/trunk/commons-jcs-core/src/test/test-conf/TestMySQLDiskCache.ccf ( 1594286
)
  /commons/proper/jcs/trunk/commons-jcs-core/src/test/test-conf/TestRemoteCacheEventLogging.ccf
( 1594286 )
  /commons/proper/jcs/trunk/commons-jcs-core/src/test/test-conf/TestRemoteClient.ccf ( 1594286
)
  /commons/proper/jcs/trunk/commons-jcs-core/src/test/test-conf/TestRemoteHttpCache.ccf (
1594286 )
  /commons/proper/jcs/trunk/commons-jcs-core/src/test/test-conf/TestRemoteServer.ccf ( 1594286
)
  /commons/proper/jcs/trunk/commons-jcs-core/src/test/test-conf/TestSimpleEventHandling.ccf
( 1594286 )
  /commons/proper/jcs/trunk/commons-jcs-core/src/test/test-conf/cache2.ccf ( 1594286 )
  /commons/proper/jcs/trunk/commons-jcs-jcache/src/main/java/org/apache/commons/jcs/jcache/JCSCache.java
( 1594286 )

****************************************************************************
Dependencies Changes:
****************************************************************************
No dependencies changed


****************************************************************************
Build Definition:
****************************************************************************
POM filename: pom.xml
Goals: clean test   
Arguments: --batch-mode -Pjava-1.7 
Build Fresh: false
Always Build: false
Default Build Definition: true
Schedule: DEFAULT_SCHEDULE
Profile Name: Maven 3.0.5 with Java 7
Description: 

****************************************************************************
Test Summary:
****************************************************************************
Tests: 379
Failures: 4
Errors: 0
Success Rate: 98
Total time: 196.434

****************************************************************************
Test Failures:
****************************************************************************

BasicRemoteCacheClientServerUnitTest
    test1SinglePut :
  java.lang.AssertionError
  java.lang.AssertionError: Cache is alive expected:<ALIVE> but was:<ERROR>
	at org.junit.Assert.fail(Assert.java:88)
	at org.junit.Assert.failNotEquals(Assert.java:743)
	at org.junit.Assert.assertEquals(Assert.java:118)
	at org.apache.commons.jcs.auxiliary.remote.server.BasicRemoteCacheClientServerUnitTest.test1SinglePut(BasicRemoteCacheClientServerUnitTest.java:118)


    test2PutRemove :
  java.lang.AssertionError
  java.lang.AssertionError: Cache is alive expected:<ALIVE> but was:<ERROR>
	at org.junit.Assert.fail(Assert.java:88)
	at org.junit.Assert.failNotEquals(Assert.java:743)
	at org.junit.Assert.assertEquals(Assert.java:118)
	at org.apache.commons.jcs.auxiliary.remote.server.BasicRemoteCacheClientServerUnitTest.test2PutRemove(BasicRemoteCacheClientServerUnitTest.java:168)


    test3PutAndListen :
  java.lang.AssertionError
  java.lang.AssertionError: Cache is alive expected:<ALIVE> but was:<ERROR>
	at org.junit.Assert.fail(Assert.java:88)
	at org.junit.Assert.failNotEquals(Assert.java:743)
	at org.junit.Assert.assertEquals(Assert.java:118)
	at org.apache.commons.jcs.auxiliary.remote.server.BasicRemoteCacheClientServerUnitTest.test3PutAndListen(BasicRemoteCacheClientServerUnitTest.java:226)


    test4PutaMultipleAndListen :
  java.lang.AssertionError
  java.lang.AssertionError: Cache is alive expected:<ALIVE> but was:<ERROR>
	at org.junit.Assert.fail(Assert.java:88)
	at org.junit.Assert.failNotEquals(Assert.java:743)
	at org.junit.Assert.assertEquals(Assert.java:118)
	at org.apache.commons.jcs.auxiliary.remote.server.BasicRemoteCacheClientServerUnitTest.test4PutaMultipleAndListen(BasicRemoteCacheClientServerUnitTest.java:280)


  


---------------------------------------------------------------------
To unsubscribe, e-mail: dev-unsubscribe@commons.apache.org
For additional commands, e-mail: dev-help@commons.apache.org


Mime
View raw message