commons-dev mailing list archives

Site index · List index
Message view « Date » · « Thread »
Top « Date » · « Thread »
From Apache Continuum <...@continuum.apache.org>
Subject [continuum] BUILD FAILURE: Apache Commons JCS - Apache Commons (Group (shared) Maven 3 Build Definition (Java 1.6))
Date Mon, 12 May 2014 20:42:59 GMT
Online report : https://continuum-ci.apache.org/continuum/buildResult.action?buildId=30673&projectId=286

Build statistics:
  State: Failed
  Previous State: Failed
  Started at: Mon 12 May 2014 20:39:12 +0000
  Finished at: Mon 12 May 2014 20:42:57 +0000
  Total time: 3m 45s
  Build Trigger: Schedule
  Build Number: 1
  Exit code: 1
  Building machine hostname: continuum-vm
  Operating system : Linux(unknown)
  Java Home version : 
          java version "1.6.0_27"
          OpenJDK Runtime Environment (IcedTea6 1.12.6) (6b27-1.12.6-1ubuntu0.12.04.4)
          OpenJDK 64-Bit Server VM (build 20.0-b12, mixed mode)
        
  Builder version :
          Apache Maven 3.0.5 (r01de14724cdef164cd33c7c8c2fe155faf9602da; 2013-02-19 13:51:28+0000)
          Maven home: /opt/apache-maven-3.0.5
          Java version: 1.6.0_27, vendor: Sun Microsystems Inc.
          Java home: /usr/lib/jvm/java-6-openjdk-amd64/jre
          Default locale: en_US, platform encoding: UTF-8
          OS name: "linux", version: "3.2.0-53-generic", arch: "amd64", family: "unix"
    
****************************************************************************
SCM Changes:
****************************************************************************
Changed: rmannibucau @ Mon 12 May 2014 19:23:19 +0000
Comment: don't call System.time methods if not needed
Files changed:
  /commons/proper/jcs/trunk/commons-jcs-jcache/src/main/java/org/apache/commons/jcs/jcache/JCSCache.java
( 1594064 )

Changed: rmannibucau @ Mon 12 May 2014 19:46:08 +0000
Comment: removing a bunch of synchronized thanks to ConcurrentHashMap - still removeAll to
review since it can be not that good but using any synch would make it slower and not scalable
Files changed:
  /commons/proper/jcs/trunk/commons-jcs-core/src/main/java/org/apache/commons/jcs/auxiliary/remote/server/RemoteCacheServerFactory.java
( 1594073 )
  /commons/proper/jcs/trunk/commons-jcs-core/src/main/java/org/apache/commons/jcs/engine/memory/AbstractDoubleLinkedListMemoryCache.java
( 1594073 )
  /commons/proper/jcs/trunk/commons-jcs-core/src/main/java/org/apache/commons/jcs/engine/memory/util/MemoryElementDescriptor.java
( 1594073 )

Changed: rmannibucau @ Mon 12 May 2014 19:57:53 +0000
Comment: cleaning list first make it less hurting in concurrent environment
Files changed:
  /commons/proper/jcs/trunk/commons-jcs-core/src/main/java/org/apache/commons/jcs/engine/memory/AbstractDoubleLinkedListMemoryCache.java
( 1594075 )

Changed: rmannibucau @ Mon 12 May 2014 20:20:23 +0000
Comment: some more synch not needed
Files changed:
  /commons/proper/jcs/trunk/commons-jcs-core/src/main/java/org/apache/commons/jcs/utils/struct/LRUMap.java
( 1594081 )

****************************************************************************
Dependencies Changes:
****************************************************************************
No dependencies changed


****************************************************************************
Build Definition:
****************************************************************************
POM filename: pom.xml
Goals: clean deploy   
Arguments: --batch-mode -Pjava-1.6 -Dgpg.skip -Prelease
Build Fresh: false
Always Build: false
Default Build Definition: true
Schedule: COMMONS_SCHEDULE
Profile Name: Maven 3.0.5
Description: Group (shared) Maven 3 Build Definition (Java 1.6)

****************************************************************************
Test Summary:
****************************************************************************
Tests: 379
Failures: 8
Errors: 0
Success Rate: 97
Total time: 124.719

****************************************************************************
Test Failures:
****************************************************************************

SimpleEventHandlingUnitTest
    testExceededMaxlifeOnrequestEvent :
  junit.framework.AssertionFailedError
  junit.framework.AssertionFailedError: Item should be null for key 0:key, but is data0
	at junit.framework.Assert.fail(Assert.java:57)
	at junit.framework.Assert.assertTrue(Assert.java:22)
	at junit.framework.Assert.assertNull(Assert.java:277)
	at junit.framework.TestCase.assertNull(TestCase.java:447)
	at org.apache.commons.jcs.engine.control.event.SimpleEventHandlingUnitTest.testExceededMaxlifeOnrequestEvent(SimpleEventHandlingUnitTest.java:201)

  JDBCDiskCacheUnitTest
    testSimpleJDBCPutGetWithHSQL :
  junit.framework.ComparisonFailure
  junit.framework.ComparisonFailure: key = [0:key] value = [null] expected:<testCache1
data 0> but was:<null>
	at junit.framework.Assert.assertEquals(Assert.java:100)
	at junit.framework.TestCase.assertEquals(TestCase.java:261)
	at org.apache.commons.jcs.auxiliary.disk.jdbc.JDBCDiskCacheUnitTest.runTestForRegion(JDBCDiskCacheUnitTest.java:110)
	at org.apache.commons.jcs.auxiliary.disk.jdbc.JDBCDiskCacheUnitTest.testSimpleJDBCPutGetWithHSQL(JDBCDiskCacheUnitTest.java:73)


  BasicRemoteCacheClientServerUnitTest
    test1SinglePut :
  java.lang.AssertionError
  java.lang.AssertionError: Cache is alive expected:<ALIVE> but was:<ERROR>
	at org.junit.Assert.fail(Assert.java:88)
	at org.junit.Assert.failNotEquals(Assert.java:743)
	at org.junit.Assert.assertEquals(Assert.java:118)
	at org.apache.commons.jcs.auxiliary.remote.server.BasicRemoteCacheClientServerUnitTest.test1SinglePut(BasicRemoteCacheClientServerUnitTest.java:118)


    test2PutRemove :
  java.lang.AssertionError
  java.lang.AssertionError: Cache is alive expected:<ALIVE> but was:<ERROR>
	at org.junit.Assert.fail(Assert.java:88)
	at org.junit.Assert.failNotEquals(Assert.java:743)
	at org.junit.Assert.assertEquals(Assert.java:118)
	at org.apache.commons.jcs.auxiliary.remote.server.BasicRemoteCacheClientServerUnitTest.test2PutRemove(BasicRemoteCacheClientServerUnitTest.java:168)


    test3PutAndListen :
  java.lang.AssertionError
  java.lang.AssertionError: Cache is alive expected:<ALIVE> but was:<ERROR>
	at org.junit.Assert.fail(Assert.java:88)
	at org.junit.Assert.failNotEquals(Assert.java:743)
	at org.junit.Assert.assertEquals(Assert.java:118)
	at org.apache.commons.jcs.auxiliary.remote.server.BasicRemoteCacheClientServerUnitTest.test3PutAndListen(BasicRemoteCacheClientServerUnitTest.java:226)


    test4PutaMultipleAndListen :
  java.lang.AssertionError
  java.lang.AssertionError: Cache is alive expected:<ALIVE> but was:<ERROR>
	at org.junit.Assert.fail(Assert.java:88)
	at org.junit.Assert.failNotEquals(Assert.java:743)
	at org.junit.Assert.assertEquals(Assert.java:118)
	at org.apache.commons.jcs.auxiliary.remote.server.BasicRemoteCacheClientServerUnitTest.test4PutaMultipleAndListen(BasicRemoteCacheClientServerUnitTest.java:280)


  JDBCDiskCacheShrinkUnitTest
    testExpireInBackground :
  junit.framework.AssertionFailedError
  junit.framework.AssertionFailedError: Removed key should be null: 0:key
	at junit.framework.Assert.fail(Assert.java:57)
	at junit.framework.Assert.assertTrue(Assert.java:22)
	at junit.framework.Assert.assertNull(Assert.java:277)
	at junit.framework.TestCase.assertNull(TestCase.java:447)
	at org.apache.commons.jcs.auxiliary.disk.jdbc.JDBCDiskCacheShrinkUnitTest.testExpireInBackground(JDBCDiskCacheShrinkUnitTest.java:107)

  JDBCDiskCacheRemovalUnitTest
    testPartialKeyRemoval_Good :
  junit.framework.ComparisonFailure
  junit.framework.ComparisonFailure: Wrong result expected:<adfadsfasfddsafasasd> but
was:<null>
	at junit.framework.Assert.assertEquals(Assert.java:100)
	at junit.framework.TestCase.assertEquals(TestCase.java:261)
	at org.apache.commons.jcs.auxiliary.disk.jdbc.JDBCDiskCacheRemovalUnitTest.testPartialKeyRemoval_Good(JDBCDiskCacheRemovalUnitTest.java:74)


  


---------------------------------------------------------------------
To unsubscribe, e-mail: dev-unsubscribe@commons.apache.org
For additional commands, e-mail: dev-help@commons.apache.org


Mime
View raw message