commons-dev mailing list archives

Site index · List index
Message view « Date » · « Thread »
Top « Date » · « Thread »
From Apache Continuum <...@continuum.apache.org>
Subject [continuum] BUILD FAILURE: Apache Commons Compress - Apache Commons (Group (shared) Maven 3 Build Definition (Java 1.6))
Date Fri, 28 Feb 2014 12:20:48 GMT
Online report : https://continuum-ci.apache.org/continuum/buildResult.action?buildId=28289&projectId=64

Build statistics:
  State: Failed
  Previous State: Ok
  Started at: Fri 28 Feb 2014 12:20:11 +0000
  Finished at: Fri 28 Feb 2014 12:20:47 +0000
  Total time: 36s
  Build Trigger: Schedule
  Build Number: 341
  Exit code: 1
  Building machine hostname: continuum-vm
  Operating system : Linux(unknown)
  Java Home version : 
          java version "1.6.0_27"
          OpenJDK Runtime Environment (IcedTea6 1.12.6) (6b27-1.12.6-1ubuntu0.12.04.4)
          OpenJDK 64-Bit Server VM (build 20.0-b12, mixed mode)
        
  Builder version :
          Apache Maven 3.0.5 (r01de14724cdef164cd33c7c8c2fe155faf9602da; 2013-02-19 13:51:28+0000)
          Maven home: /opt/apache-maven-3.0.5
          Java version: 1.6.0_27, vendor: Sun Microsystems Inc.
          Java home: /usr/lib/jvm/java-6-openjdk-amd64/jre
          Default locale: en_US, platform encoding: ANSI_X3.4-1968
          OS name: "linux", version: "3.2.0-53-generic", arch: "amd64", family: "unix"
    
****************************************************************************
SCM Changes:
****************************************************************************
Changed: bodewig @ Fri 28 Feb 2014 12:17:32 +0000
Comment: COMPRESS-257 add the remaining BCJ implementations provided by XZ for Java
Files changed:
  /commons/proper/compress/trunk/src/main/java/org/apache/commons/compress/archivers/sevenz/Coders.java
( 1572929 )
  /commons/proper/compress/trunk/src/main/java/org/apache/commons/compress/archivers/sevenz/SevenZMethod.java
( 1572929 )
  /commons/proper/compress/trunk/src/test/java/org/apache/commons/compress/archivers/sevenz/SevenZOutputFileTest.java
( 1572929 )

****************************************************************************
Dependencies Changes:
****************************************************************************
No dependencies changed


****************************************************************************
Build Definition:
****************************************************************************
POM filename: pom.xml
Goals: clean deploy   
Arguments: --batch-mode -Pjava-1.6 -Dgpg.skip -Prelease
Build Fresh: false
Always Build: false
Default Build Definition: true
Schedule: COMMONS_SCHEDULE
Profile Name: Maven 3.0.5
Description: Group (shared) Maven 3 Build Definition (Java 1.6)

****************************************************************************
Test Summary:
****************************************************************************
Tests: 464
Failures: 6
Errors: 0
Success Rate: 98
Total time: 9.683001

****************************************************************************
Test Failures:
****************************************************************************

SevenZOutputFileTest
    testBCJX86Roundtrip :
  java.lang.AssertionError:
  java.lang.AssertionError: null
	at org.tukaani.xz.SimpleInputStream.<init>(Unknown Source)
	at org.tukaani.xz.X86Options.getInputStream(Unknown Source)
	at org.apache.commons.compress.archivers.sevenz.Coders$BCJDecoder.decode(Coders.java:122)
	at org.apache.commons.compress.archivers.sevenz.Coders.addDecoder(Coders.java:73)
	at org.apache.commons.compress.archivers.sevenz.SevenZFile.buildDecoderStack(SevenZFile.java:853)
	at org.apache.commons.compress.archivers.sevenz.SevenZFile.buildDecodingStream(SevenZFile.java:820)
	at org.apache.commons.compress.archivers.sevenz.SevenZFile.getNextEntry(SevenZFile.java:151)
	at org.apache.commons.compress.archivers.sevenz.SevenZOutputFileTest.verifyFile(SevenZOutputFileTest.java:395)
	at org.apache.commons.compress.archivers.sevenz.SevenZOutputFileTest.createAndReadBack(SevenZOutputFileTest.java:439)
	at org.apache.commons.compress.archivers.sevenz.SevenZOutputFileTest.testFilterRoundTrip(SevenZOutputFileTest.java:425)
	at org.apache.commons.compress.archivers.sevenz.SevenZOutputFileTest.testBCJX86Roundtrip(SevenZOutputFileTest.java:238)


    testBCJARMThumbRoundtrip :
  java.lang.AssertionError:
  java.lang.AssertionError: null
	at org.tukaani.xz.SimpleInputStream.<init>(Unknown Source)
	at org.tukaani.xz.ARMThumbOptions.getInputStream(Unknown Source)
	at org.apache.commons.compress.archivers.sevenz.Coders$BCJDecoder.decode(Coders.java:122)
	at org.apache.commons.compress.archivers.sevenz.Coders.addDecoder(Coders.java:73)
	at org.apache.commons.compress.archivers.sevenz.SevenZFile.buildDecoderStack(SevenZFile.java:853)
	at org.apache.commons.compress.archivers.sevenz.SevenZFile.buildDecodingStream(SevenZFile.java:820)
	at org.apache.commons.compress.archivers.sevenz.SevenZFile.getNextEntry(SevenZFile.java:151)
	at org.apache.commons.compress.archivers.sevenz.SevenZOutputFileTest.verifyFile(SevenZOutputFileTest.java:395)
	at org.apache.commons.compress.archivers.sevenz.SevenZOutputFileTest.createAndReadBack(SevenZOutputFileTest.java:439)
	at org.apache.commons.compress.archivers.sevenz.SevenZOutputFileTest.testFilterRoundTrip(SevenZOutputFileTest.java:425)
	at org.apache.commons.compress.archivers.sevenz.SevenZOutputFileTest.testBCJARMThumbRoundtrip(SevenZOutputFileTest.java:246)


    testBCJPPCRoundtrip :
  java.lang.AssertionError:
  java.lang.AssertionError: null
	at org.tukaani.xz.SimpleInputStream.<init>(Unknown Source)
	at org.tukaani.xz.PowerPCOptions.getInputStream(Unknown Source)
	at org.apache.commons.compress.archivers.sevenz.Coders$BCJDecoder.decode(Coders.java:122)
	at org.apache.commons.compress.archivers.sevenz.Coders.addDecoder(Coders.java:73)
	at org.apache.commons.compress.archivers.sevenz.SevenZFile.buildDecoderStack(SevenZFile.java:853)
	at org.apache.commons.compress.archivers.sevenz.SevenZFile.buildDecodingStream(SevenZFile.java:820)
	at org.apache.commons.compress.archivers.sevenz.SevenZFile.getNextEntry(SevenZFile.java:151)
	at org.apache.commons.compress.archivers.sevenz.SevenZOutputFileTest.verifyFile(SevenZOutputFileTest.java:395)
	at org.apache.commons.compress.archivers.sevenz.SevenZOutputFileTest.createAndReadBack(SevenZOutputFileTest.java:439)
	at org.apache.commons.compress.archivers.sevenz.SevenZOutputFileTest.testFilterRoundTrip(SevenZOutputFileTest.java:425)
	at org.apache.commons.compress.archivers.sevenz.SevenZOutputFileTest.testBCJPPCRoundtrip(SevenZOutputFileTest.java:254)


    testBCJARMRoundtrip :
  java.lang.AssertionError:
  java.lang.AssertionError: null
	at org.tukaani.xz.SimpleInputStream.<init>(Unknown Source)
	at org.tukaani.xz.ARMOptions.getInputStream(Unknown Source)
	at org.apache.commons.compress.archivers.sevenz.Coders$BCJDecoder.decode(Coders.java:122)
	at org.apache.commons.compress.archivers.sevenz.Coders.addDecoder(Coders.java:73)
	at org.apache.commons.compress.archivers.sevenz.SevenZFile.buildDecoderStack(SevenZFile.java:853)
	at org.apache.commons.compress.archivers.sevenz.SevenZFile.buildDecodingStream(SevenZFile.java:820)
	at org.apache.commons.compress.archivers.sevenz.SevenZFile.getNextEntry(SevenZFile.java:151)
	at org.apache.commons.compress.archivers.sevenz.SevenZOutputFileTest.verifyFile(SevenZOutputFileTest.java:395)
	at org.apache.commons.compress.archivers.sevenz.SevenZOutputFileTest.createAndReadBack(SevenZOutputFileTest.java:439)
	at org.apache.commons.compress.archivers.sevenz.SevenZOutputFileTest.testFilterRoundTrip(SevenZOutputFileTest.java:425)
	at org.apache.commons.compress.archivers.sevenz.SevenZOutputFileTest.testBCJARMRoundtrip(SevenZOutputFileTest.java:242)


    testBCJSparcRoundtrip :
  java.lang.AssertionError:
  java.lang.AssertionError: null
	at org.tukaani.xz.SimpleInputStream.<init>(Unknown Source)
	at org.tukaani.xz.SPARCOptions.getInputStream(Unknown Source)
	at org.apache.commons.compress.archivers.sevenz.Coders$BCJDecoder.decode(Coders.java:122)
	at org.apache.commons.compress.archivers.sevenz.Coders.addDecoder(Coders.java:73)
	at org.apache.commons.compress.archivers.sevenz.SevenZFile.buildDecoderStack(SevenZFile.java:853)
	at org.apache.commons.compress.archivers.sevenz.SevenZFile.buildDecodingStream(SevenZFile.java:820)
	at org.apache.commons.compress.archivers.sevenz.SevenZFile.getNextEntry(SevenZFile.java:151)
	at org.apache.commons.compress.archivers.sevenz.SevenZOutputFileTest.verifyFile(SevenZOutputFileTest.java:395)
	at org.apache.commons.compress.archivers.sevenz.SevenZOutputFileTest.createAndReadBack(SevenZOutputFileTest.java:439)
	at org.apache.commons.compress.archivers.sevenz.SevenZOutputFileTest.testFilterRoundTrip(SevenZOutputFileTest.java:425)
	at org.apache.commons.compress.archivers.sevenz.SevenZOutputFileTest.testBCJSparcRoundtrip(SevenZOutputFileTest.java:258)


    testBCJIA64Roundtrip :
  java.lang.AssertionError:
  java.lang.AssertionError: null
	at org.tukaani.xz.SimpleInputStream.<init>(Unknown Source)
	at org.tukaani.xz.IA64Options.getInputStream(Unknown Source)
	at org.apache.commons.compress.archivers.sevenz.Coders$BCJDecoder.decode(Coders.java:122)
	at org.apache.commons.compress.archivers.sevenz.Coders.addDecoder(Coders.java:73)
	at org.apache.commons.compress.archivers.sevenz.SevenZFile.buildDecoderStack(SevenZFile.java:853)
	at org.apache.commons.compress.archivers.sevenz.SevenZFile.buildDecodingStream(SevenZFile.java:820)
	at org.apache.commons.compress.archivers.sevenz.SevenZFile.getNextEntry(SevenZFile.java:151)
	at org.apache.commons.compress.archivers.sevenz.SevenZOutputFileTest.verifyFile(SevenZOutputFileTest.java:395)
	at org.apache.commons.compress.archivers.sevenz.SevenZOutputFileTest.createAndReadBack(SevenZOutputFileTest.java:439)
	at org.apache.commons.compress.archivers.sevenz.SevenZOutputFileTest.testFilterRoundTrip(SevenZOutputFileTest.java:425)
	at org.apache.commons.compress.archivers.sevenz.SevenZOutputFileTest.testBCJIA64Roundtrip(SevenZOutputFileTest.java:250)


  


---------------------------------------------------------------------
To unsubscribe, e-mail: dev-unsubscribe@commons.apache.org
For additional commands, e-mail: dev-help@commons.apache.org


Mime
View raw message