commons-dev mailing list archives

Site index · List index
Message view « Date » · « Thread »
Top « Date » · « Thread »
From Gump <>
Subject [GUMP@vmgump]: Project commons-vfs2 (in module apache-commons) failed
Date Fri, 25 Jan 2013 11:43:31 GMT
To whom it may engage...
This is an automated request, but not an unsolicited one. For 
more information please visit, 
and/or contact the folk at

Project commons-vfs2 has an issue affecting its community integration.
This issue affects 5 projects,
 and has been outstanding for 256 runs.
The current state of this project is 'Failed', with reason 'Build Failed'.
For reference only, the following projects are affected by this:
    - commons-configuration :  Apache Commons
    - commons-configuration-test :  Apache Commons
    - commons-vfs2 :  Apache Commons
    - commons-vfs2-sandbox :  Apache Commons
    - commons-vfs2-test :  Apache Commons

Full details are available at:

That said, some information snippets are provided here.

The following annotations (debug/informational/warning/error messages) were provided:
 -DEBUG- Sole jar output [commons-vfs2-*[0-9T].jar] identifier set to project name
 -INFO- Optional dependency doxia-site-renderer prerequisite failed with reason build failed
 -INFO- Optional dependency commons-net failed with reason build failed
 -INFO- Optional dependency commons-compress failed with reason build failed
 -INFO- Optional dependency mina prerequisite failed with reason build failed
 -DEBUG- (Apache Gump generated) Apache Maven Settings in: /srv/gump/public/workspace/apache-commons/vfs/gump_mvn_settings.xml
 -INFO- Failed with reason build failed
 -DEBUG- Maven POM in: /srv/gump/public/workspace/apache-commons/vfs/pom.xml
 -DEBUG- Extracted fallback artifacts from Gump Repository

The following work was performed:
Work Name: build_apache-commons_commons-vfs2 (Type: Build)
Work ended in a state of : Failed
Elapsed: 6 secs
Command Line: /opt/maven3/bin/mvn --batch-mode -DskipTests=true --settings /srv/gump/public/workspace/apache-commons/vfs/gump_mvn_settings.xml
[Working Directory: /srv/gump/public/workspace/apache-commons/vfs]
M2_HOME: /opt/maven3
[INFO] Scanning for projects...
[WARNING] Some problems were encountered while building the effective model for org.apache.commons:commons-vfs2-project:pom:2.1-SNAPSHOT
[WARNING] 'parent.relativePath' points at org.apache.commons:commons-proper-aggregator instead
of org.apache.commons:commons-parent, please verify your project structure @ line 22, column
[WARNING] It is highly recommended to fix these problems because they threaten the stability
of your build.
[WARNING] For this reason, future Maven versions might no longer support building such malformed
[INFO] ------------------------------------------------------------------------
[INFO] Reactor Build Order:
[INFO] Commons VFS
[INFO] Commons VFS Core
[INFO] Commons VFS Examples
[INFO] Commons VFS Distribution
[INFO] ------------------------------------------------------------------------
[INFO] Building Commons VFS 2.1-SNAPSHOT
[INFO] ------------------------------------------------------------------------
[INFO] --- maven-antrun-plugin:1.7:run (javadoc.resources) @ commons-vfs2-project ---
Downloading: http://localhost:8192/maven2/org/codehaus/plexus/plexus-interpolation/1.1/plexus-interpolation-1.1.jar
[INFO] ------------------------------------------------------------------------
[INFO] Reactor Summary:
[INFO] Commons VFS ....................................... FAILURE [1.609s]
[INFO] Commons VFS Core .................................. SKIPPED
[INFO] Commons VFS Examples .............................. SKIPPED
[INFO] Commons VFS Distribution .......................... SKIPPED
[INFO] ------------------------------------------------------------------------
[INFO] ------------------------------------------------------------------------
[INFO] Total time: 3.149s
[INFO] Finished at: Fri Jan 25 11:43:31 UTC 2013
[INFO] Final Memory: 6M/16M
[INFO] ------------------------------------------------------------------------
[ERROR] Failed to execute goal org.apache.maven.plugins:maven-antrun-plugin:1.7:run (javadoc.resources)
on project commons-vfs2-project: Execution javadoc.resources of goal org.apache.maven.plugins:maven-antrun-plugin:1.7:run
failed: Plugin org.apache.maven.plugins:maven-antrun-plugin:1.7 or one of its dependencies
could not be resolved: Could not transfer artifact org.codehaus.plexus:plexus-interpolation:jar:1.1
from/to gump-central (http://localhost:8192/maven2): Error transferring file: Connection refused
-> [Help 1]
[ERROR] To see the full stack trace of the errors, re-run Maven with the -e switch.
[ERROR] Re-run Maven using the -X switch to enable full debug logging.
[ERROR] For more information about the errors and possible solutions, please read the following
[ERROR] [Help 1]

To subscribe to this information via syndicated feeds:
- RSS:
- Atom:

============================== Gump Tracking Only ===
Produced by Apache Gump(TM) version 2.3.
Gump Run 20130125060108,
Gump E-mail Identifier (unique within run) #100.

Apache Gump [Instance: vmgump]

To unsubscribe, e-mail:
For additional commands, e-mail:

View raw message