commons-dev mailing list archives

Site index · List index
Message view « Date » · « Thread »
Top « Date » · « Thread »
From Gump <iss...@commons.apache.org>
Subject [GUMP@vmgump]: Project commons-dbutils (in module apache-commons) failed
Date Thu, 24 Jan 2013 05:20:12 GMT
To whom it may engage...
        
This is an automated request, but not an unsolicited one. For 
more information please visit http://gump.apache.org/nagged.html, 
and/or contact the folk at general@gump.apache.org.

Project commons-dbutils has an issue affecting its community integration.
This issue affects 1 projects,
 and has been outstanding for 322 runs.
The current state of this project is 'Failed', with reason 'Build Failed'.
For reference only, the following projects are affected by this:
    - commons-dbutils :  Commons DbUtils


Full details are available at:
    http://vmgump.apache.org/gump/public/apache-commons/commons-dbutils/index.html

That said, some information snippets are provided here.

The following annotations (debug/informational/warning/error messages) were provided:
 -DEBUG- Sole jar output [commons-dbutils-*[0-9T].jar] identifier set to project name
 -INFO- Optional dependency velocity-engine prerequisite failed with reason build failed
 -INFO- Optional dependency commons-collections failed with reason build failed
 -INFO- Optional dependency mockito prerequisite failed with reason build failed
 -INFO- Optional dependency objenesis failed with reason build failed
 -DEBUG- (Apache Gump generated) Apache Maven Settings in: /srv/gump/public/workspace/apache-commons/dbutils/gump_mvn_settings.xml
 -INFO- Failed with reason build failed
 -DEBUG- Maven POM in: /srv/gump/public/workspace/apache-commons/dbutils/pom.xml
 -INFO- Project Reports in: /srv/gump/public/workspace/apache-commons/dbutils/target/surefire-reports
 -INFO- Failed to extract fallback artifacts from Gump Repository



The following work was performed:
http://vmgump.apache.org/gump/public/apache-commons/commons-dbutils/gump_work/build_apache-commons_commons-dbutils.html
Work Name: build_apache-commons_commons-dbutils (Type: Build)
Work ended in a state of : Failed
Elapsed: 29 secs
Command Line: /opt/maven2/bin/mvn --batch-mode --settings /srv/gump/public/workspace/apache-commons/dbutils/gump_mvn_settings.xml
package 
[Working Directory: /srv/gump/public/workspace/apache-commons/dbutils]
M2_HOME: /opt/maven2
---------------------------------------------
Tests run: 3, Failures: 0, Errors: 0, Skipped: 0, Time elapsed: 0.01 sec
Running org.apache.commons.dbutils.DbUtilsTest
Tests run: 31, Failures: 0, Errors: 0, Skipped: 0, Time elapsed: 0.17 sec
Running org.apache.commons.dbutils.AsyncQueryRunnerTest
Tests run: 32, Failures: 1, Errors: 0, Skipped: 0, Time elapsed: 0.468 sec <<< FAILURE!
testInsertUsesGivenQueryRunner(org.apache.commons.dbutils.AsyncQueryRunnerTest)  Time elapsed:
0.054 sec  <<< FAILURE!
org.mockito.exceptions.verification.WantedButNotInvoked: 
Wanted but not invoked:
queryRunner.insert(
    "1",
    org.apache.commons.dbutils.handlers.ArrayHandler@70d95674
);
-> at org.apache.commons.dbutils.AsyncQueryRunnerTest.testInsertUsesGivenQueryRunner(AsyncQueryRunnerTest.java:448)
Actually, there were zero interactions with this mock.

	at org.apache.commons.dbutils.AsyncQueryRunnerTest.testInsertUsesGivenQueryRunner(AsyncQueryRunnerTest.java:448)

Running org.apache.commons.dbutils.QueryRunnerTest
Tests run: 34, Failures: 0, Errors: 0, Skipped: 0, Time elapsed: 0.335 sec
Running org.apache.commons.dbutils.GenerousBeanProcessorTest
Tests run: 2, Failures: 0, Errors: 0, Skipped: 0, Time elapsed: 0.013 sec

Results :

Failed tests: 
  AsyncQueryRunnerTest.testInsertUsesGivenQueryRunner:448 
Wanted but not invoked:
queryRunner.insert(
    "1",
    org.apache.commons.dbutils.handlers.ArrayHandler@70d95674
);
-> at org.apache.commons.dbutils.AsyncQueryRunnerTest.testInsertUsesGivenQueryRunner(AsyncQueryRunnerTest.java:448)
Actually, there were zero interactions with this mock.


Tests run: 222, Failures: 1, Errors: 0, Skipped: 0

[INFO] ------------------------------------------------------------------------
[ERROR] BUILD FAILURE
[INFO] ------------------------------------------------------------------------
[INFO] There are test failures.

Please refer to /srv/gump/public/workspace/apache-commons/dbutils/target/surefire-reports
for the individual test results.
[INFO] ------------------------------------------------------------------------
[INFO] For more information, run Maven with the -e switch
[INFO] ------------------------------------------------------------------------
[INFO] Total time: 27 seconds
[INFO] Finished at: Thu Jan 24 05:20:10 UTC 2013
[INFO] Final Memory: 47M/115M
[INFO] ------------------------------------------------------------------------
---------------------------------------------

To subscribe to this information via syndicated feeds:
- RSS: http://vmgump.apache.org/gump/public/apache-commons/commons-dbutils/rss.xml
- Atom: http://vmgump.apache.org/gump/public/apache-commons/commons-dbutils/atom.xml

============================== Gump Tracking Only ===
Produced by Apache Gump(TM) version 2.3.
Gump Run 20130124000013, vmgump.apache.org:vmgump:20130124000013
Gump E-mail Identifier (unique within run) #68.

--
Apache Gump
http://gump.apache.org/ [Instance: vmgump]

---------------------------------------------------------------------
To unsubscribe, e-mail: dev-unsubscribe@commons.apache.org
For additional commands, e-mail: dev-help@commons.apache.org


Mime
View raw message