commons-dev mailing list archives

Site index · List index
Message view « Date » · « Thread »
Top « Date » · « Thread »
From Gump <iss...@commons.apache.org>
Subject [GUMP@vmgump]: Project commons-configuration (in module apache-commons) failed
Date Tue, 22 Jan 2013 18:14:35 GMT
To whom it may engage...
        
This is an automated request, but not an unsolicited one. For 
more information please visit http://gump.apache.org/nagged.html, 
and/or contact the folk at general@gump.apache.org.

Project commons-configuration has an issue affecting its community integration.
This issue affects 2 projects.
The current state of this project is 'Failed', with reason 'Build Failed'.
For reference only, the following projects are affected by this:
    - commons-configuration :  Apache Commons
    - commons-configuration-test :  Apache Commons


Full details are available at:
    http://vmgump.apache.org/gump/public/apache-commons/commons-configuration/index.html

That said, some information snippets are provided here.

The following annotations (debug/informational/warning/error messages) were provided:
 -DEBUG- Sole jar output [commons-configuration-*[0-9T].jar] identifier set to project name
 -INFO- Optional dependency commons-digester prerequisite failed with reason build failed
 -DEBUG- (Apache Gump generated) Apache Maven Settings in: /srv/gump/public/workspace/apache-commons/configuration/gump_mvn_settings.xml
 -INFO- Failed with reason build failed
 -DEBUG- Maven POM in: /srv/gump/public/workspace/apache-commons/configuration/pom.xml
 -INFO- Project Reports in: /srv/gump/public/workspace/apache-commons/configuration/target/surefire-reports
 -WARNING- No directory [/srv/gump/public/workspace/apache-commons/configuration/target/surefire-reports]
 -DEBUG- Extracted fallback artifacts from Gump Repository



The following work was performed:
http://vmgump.apache.org/gump/public/apache-commons/commons-configuration/gump_work/build_apache-commons_commons-configuration.html
Work Name: build_apache-commons_commons-configuration (Type: Build)
Work ended in a state of : Failed
Elapsed: 18 secs
Command Line: /opt/maven2/bin/mvn --batch-mode -DskipTests=true --settings /srv/gump/public/workspace/apache-commons/configuration/gump_mvn_settings.xml
package 
[Working Directory: /srv/gump/public/workspace/apache-commons/configuration]
M2_HOME: /opt/maven2
---------------------------------------------
4K downloaded  (codehaus-parent-4.pom)
Downloading: http://localhost:8192/maven2/org/codehaus/mojo/buildnumber-maven-plugin/1.2/buildnumber-maven-plugin-1.2.jar
25K downloaded  (buildnumber-maven-plugin-1.2.jar)
Downloading: http://localhost:8192/maven2/org/apache/maven/plugins/maven-assembly-plugin/2.4/maven-assembly-plugin-2.4.pom
16K downloaded  (maven-assembly-plugin-2.4.pom)
Downloading: http://localhost:8192/maven2/org/apache/maven/plugins/maven-assembly-plugin/2.4/maven-assembly-plugin-2.4.jar
220K downloaded  (maven-assembly-plugin-2.4.jar)
Downloading: http://localhost:8192/maven2/org/apache/maven/plugins/maven-source-plugin/2.2.1/maven-source-plugin-2.2.1.pom
6K downloaded  (maven-source-plugin-2.2.1.pom)
Downloading: http://localhost:8192/maven2/org/apache/maven/plugins/maven-source-plugin/2.2.1/maven-source-plugin-2.2.1.jar
29K downloaded  (maven-source-plugin-2.2.1.jar)
[WARNING] *** CHECKSUM FAILED - Checksum failed on download: local = 'cd8b343550bc4ccf0c411dbdff33f853e14ed499';
remote = '7b6e93e5e6403323cd70a18829a33f6cb4c0388d' - RETRYING
Downloading: http://localhost:8192/maven2/org/apache/maven/plugins/maven-source-plugin/2.2.1/maven-source-plugin-2.2.1.jar
29K downloaded  (maven-source-plugin-2.2.1.jar)
[WARNING] *** CHECKSUM FAILED - Checksum failed on download: local = 'cd8b343550bc4ccf0c411dbdff33f853e14ed499';
remote = '7b6e93e5e6403323cd70a18829a33f6cb4c0388d' - IGNORING
[INFO] ------------------------------------------------------------------------
[ERROR] FATAL ERROR
[INFO] ------------------------------------------------------------------------
[INFO] The plugin descriptor for the plugin Plugin [org.apache.maven.plugins:maven-source-plugin]
was not found. Please verify that the plugin JAR /srv/gump/public/workspace/mvnlocalrepo/commons-configuration.mvnlocalrepo/org/apache/maven/plugins/maven-source-plugin/2.2.1/maven-source-plugin-2.2.1.jar
is intact.
[INFO] ------------------------------------------------------------------------
[INFO] Trace
java.lang.IllegalStateException: The plugin descriptor for the plugin Plugin [org.apache.maven.plugins:maven-source-plugin]
was not found. Please verify that the plugin JAR /srv/gump/public/workspace/mvnlocalrepo/commons-configuration.mvnlocalrepo/org/apache/maven/plugins/maven-source-plugin/2.2.1/maven-source-plugin-2.2.1.jar
is intact.
	at org.apache.maven.plugin.DefaultPluginManager.addPlugin(DefaultPluginManager.java:360)
	at org.apache.maven.plugin.DefaultPluginManager.verifyVersionedPlugin(DefaultPluginManager.java:224)
	at org.apache.maven.plugin.DefaultPluginManager.verifyPlugin(DefaultPluginManager.java:184)
	at org.apache.maven.plugin.DefaultPluginManager.loadPluginDescriptor(DefaultPluginManager.java:1642)
	at org.apache.maven.lifecycle.DefaultLifecycleExecutor.verifyPlugin(DefaultLifecycleExecutor.java:1540)
	at org.apache.maven.lifecycle.DefaultLifecycleExecutor.bindPluginToLifecycle(DefaultLifecycleExecutor.java:1503)
	at org.apache.maven.lifecycle.DefaultLifecycleExecutor.constructLifecycleMappings(DefaultLifecycleExecutor.java:1282)
	at org.apache.maven.lifecycle.DefaultLifecycleExecutor.executeGoal(DefaultLifecycleExecutor.java:534)
	at org.apache.maven.lifecycle.DefaultLifecycleExecutor.executeGoalAndHandleFailures(DefaultLifecycleExecutor.java:387)
	at org.apache.maven.lifecycle.DefaultLifecycleExecutor.executeTaskSegments(DefaultLifecycleExecutor.java:348)
	at org.apache.maven.lifecycle.DefaultLifecycleExecutor.execute(DefaultLifecycleExecutor.java:180)
	at org.apache.maven.DefaultMaven.doExecute(DefaultMaven.java:328)
	at org.apache.maven.DefaultMaven.execute(DefaultMaven.java:138)
	at org.apache.maven.cli.MavenCli.main(MavenCli.java:362)
	at org.apache.maven.cli.compat.CompatibleMain.main(CompatibleMain.java:60)
	at sun.reflect.NativeMethodAccessorImpl.invoke0(Native Method)
	at sun.reflect.NativeMethodAccessorImpl.invoke(NativeMethodAccessorImpl.java:57)
	at sun.reflect.DelegatingMethodAccessorImpl.invoke(DelegatingMethodAccessorImpl.java:43)
	at java.lang.reflect.Method.invoke(Method.java:601)
	at org.codehaus.classworlds.Launcher.launchEnhanced(Launcher.java:315)
	at org.codehaus.classworlds.Launcher.launch(Launcher.java:255)
	at org.codehaus.classworlds.Launcher.mainWithExitCode(Launcher.java:430)
	at org.codehaus.classworlds.Launcher.main(Launcher.java:375)
[INFO] ------------------------------------------------------------------------
[INFO] Total time: 17 seconds
[INFO] Finished at: Tue Jan 22 18:14:29 UTC 2013
[INFO] Final Memory: 13M/32M
[INFO] ------------------------------------------------------------------------
---------------------------------------------

To subscribe to this information via syndicated feeds:
- RSS: http://vmgump.apache.org/gump/public/apache-commons/commons-configuration/rss.xml
- Atom: http://vmgump.apache.org/gump/public/apache-commons/commons-configuration/atom.xml

============================== Gump Tracking Only ===
Produced by Apache Gump(TM) version 2.3.
Gump Run 10001222012013, vmgump.apache.org:vmgump:10001222012013
Gump E-mail Identifier (unique within run) #18.

--
Apache Gump
http://gump.apache.org/ [Instance: vmgump]

---------------------------------------------------------------------
To unsubscribe, e-mail: dev-unsubscribe@commons.apache.org
For additional commands, e-mail: dev-help@commons.apache.org


Mime
View raw message