commons-dev mailing list archives

Site index · List index
Message view « Date » · « Thread »
Top « Date » · « Thread »
From Gump <iss...@commons.apache.org>
Subject [GUMP@vmgump]: Project commons-dbutils (in module apache-commons) failed
Date Wed, 16 Jan 2013 13:00:37 GMT
To whom it may engage...
        
This is an automated request, but not an unsolicited one. For 
more information please visit http://gump.apache.org/nagged.html, 
and/or contact the folk at general@gump.apache.org.

Project commons-dbutils has an issue affecting its community integration.
This issue affects 1 projects,
 and has been outstanding for 307 runs.
The current state of this project is 'Failed', with reason 'Build Failed'.
For reference only, the following projects are affected by this:
    - commons-dbutils :  Commons DbUtils


Full details are available at:
    http://vmgump.apache.org/gump/public/apache-commons/commons-dbutils/index.html

That said, some information snippets are provided here.

The following annotations (debug/informational/warning/error messages) were provided:
 -DEBUG- Sole jar output [commons-dbutils-*[0-9T].jar] identifier set to project name
 -INFO- Optional dependency mockito failed with reason build failed
 -DEBUG- (Apache Gump generated) Apache Maven Settings in: /srv/gump/public/workspace/apache-commons/dbutils/gump_mvn_settings.xml
 -INFO- Failed with reason build failed
 -DEBUG- Maven POM in: /srv/gump/public/workspace/apache-commons/dbutils/pom.xml
 -INFO- Project Reports in: /srv/gump/public/workspace/apache-commons/dbutils/target/surefire-reports
 -INFO- Failed to extract fallback artifacts from Gump Repository



The following work was performed:
http://vmgump.apache.org/gump/public/apache-commons/commons-dbutils/gump_work/build_apache-commons_commons-dbutils.html
Work Name: build_apache-commons_commons-dbutils (Type: Build)
Work ended in a state of : Failed
Elapsed: 30 secs
Command Line: /opt/maven2/bin/mvn --batch-mode --settings /srv/gump/public/workspace/apache-commons/dbutils/gump_mvn_settings.xml
package 
[Working Directory: /srv/gump/public/workspace/apache-commons/dbutils]
M2_HOME: /opt/maven2
---------------------------------------------
Running org.apache.commons.dbutils.handlers.BeanListHandlerTest
Tests run: 4, Failures: 0, Errors: 0, Skipped: 0, Time elapsed: 0.034 sec
Running org.apache.commons.dbutils.handlers.BeanMapHandlerTest
Tests run: 5, Failures: 0, Errors: 0, Skipped: 0, Time elapsed: 0.602 sec
Running org.apache.commons.dbutils.handlers.KeyedHandlerTest
Tests run: 6, Failures: 0, Errors: 0, Skipped: 0, Time elapsed: 0.01 sec
Running org.apache.commons.dbutils.ProxyFactoryTest
Tests run: 9, Failures: 0, Errors: 0, Skipped: 0, Time elapsed: 0.145 sec
Running org.apache.commons.dbutils.wrappers.SqlNullCheckedResultSetTest
Tests run: 43, Failures: 0, Errors: 0, Skipped: 0, Time elapsed: 0.216 sec
Running org.apache.commons.dbutils.wrappers.StringTrimmedResultSetTest
Tests run: 5, Failures: 0, Errors: 0, Skipped: 0, Time elapsed: 0.008 sec
Running org.apache.commons.dbutils.BaseResultSetHandlerTestCase
Tests run: 2, Failures: 0, Errors: 0, Skipped: 0, Time elapsed: 0.006 sec
Running org.apache.commons.dbutils.ResultSetIteratorTest
Tests run: 3, Failures: 0, Errors: 0, Skipped: 0, Time elapsed: 0.013 sec
Running org.apache.commons.dbutils.BeanProcessorTest
Tests run: 5, Failures: 0, Errors: 0, Skipped: 0, Time elapsed: 0.018 sec
Running org.apache.commons.dbutils.BasicRowProcessorTest
Tests run: 6, Failures: 0, Errors: 0, Skipped: 0, Time elapsed: 0.029 sec
Running org.apache.commons.dbutils.QueryLoaderTest
Tests run: 3, Failures: 0, Errors: 0, Skipped: 0, Time elapsed: 0.011 sec
Running org.apache.commons.dbutils.DbUtilsTest
Tests run: 31, Failures: 0, Errors: 0, Skipped: 0, Time elapsed: 0.17 sec
Running org.apache.commons.dbutils.AsyncQueryRunnerTest
Tests run: 32, Failures: 1, Errors: 0, Skipped: 0, Time elapsed: 0.456 sec <<< FAILURE!
Running org.apache.commons.dbutils.QueryRunnerTest
Tests run: 34, Failures: 0, Errors: 0, Skipped: 0, Time elapsed: 0.244 sec
Running org.apache.commons.dbutils.GenerousBeanProcessorTest
Tests run: 2, Failures: 0, Errors: 0, Skipped: 0, Time elapsed: 0.01 sec

Results :

Failed tests:   testInsertUsesGivenQueryRunner(org.apache.commons.dbutils.AsyncQueryRunnerTest):
(..)

Tests run: 222, Failures: 1, Errors: 0, Skipped: 0

[INFO] ------------------------------------------------------------------------
[ERROR] BUILD FAILURE
[INFO] ------------------------------------------------------------------------
[INFO] There are test failures.

Please refer to /srv/gump/public/workspace/apache-commons/dbutils/target/surefire-reports
for the individual test results.
[INFO] ------------------------------------------------------------------------
[INFO] For more information, run Maven with the -e switch
[INFO] ------------------------------------------------------------------------
[INFO] Total time: 29 seconds
[INFO] Finished at: Wed Jan 16 13:00:35 UTC 2013
[INFO] Final Memory: 42M/101M
[INFO] ------------------------------------------------------------------------
---------------------------------------------

To subscribe to this information via syndicated feeds:
- RSS: http://vmgump.apache.org/gump/public/apache-commons/commons-dbutils/rss.xml
- Atom: http://vmgump.apache.org/gump/public/apache-commons/commons-dbutils/atom.xml

============================== Gump Tracking Only ===
Produced by Apache Gump(TM) version 2.3.
Gump Run 02010616012013, vmgump.apache.org:vmgump:02010616012013
Gump E-mail Identifier (unique within run) #44.

--
Apache Gump
http://gump.apache.org/ [Instance: vmgump]

---------------------------------------------------------------------
To unsubscribe, e-mail: dev-unsubscribe@commons.apache.org
For additional commands, e-mail: dev-help@commons.apache.org


Mime
View raw message