commons-dev mailing list archives

Site index · List index
Message view « Date » · « Thread »
Top « Date » · « Thread »
From Gump <>
Subject [GUMP@vmgump]: Project commons-vfs2-test (in module apache-commons) failed
Date Thu, 10 Jan 2013 07:53:18 GMT
To whom it may engage...
This is an automated request, but not an unsolicited one. For 
more information please visit, 
and/or contact the folk at

Project commons-vfs2-test has an issue affecting its community integration.
This issue affects 1 projects.
The current state of this project is 'Failed', with reason 'Build Failed'.
For reference only, the following projects are affected by this:
    - commons-vfs2-test :  Apache Commons

Full details are available at:

That said, some information snippets are provided here.

The following annotations (debug/informational/warning/error messages) were provided:
 -WARNING- Overriding Maven settings: [/srv/gump/public/workspace/apache-commons/vfs/gump_mvn_settings.xml]
 -DEBUG- (Apache Gump generated) Apache Maven Settings in: /srv/gump/public/workspace/apache-commons/vfs/gump_mvn_settings.xml
 -INFO- Failed with reason build failed
 -DEBUG- Maven POM in: /srv/gump/public/workspace/apache-commons/vfs/pom.xml
 -INFO- Project Reports in: /srv/gump/public/workspace/apache-commons/vfs/core/target/surefire-reports

The following work was performed:
Work Name: build_apache-commons_commons-vfs2-test (Type: Build)
Work ended in a state of : Failed
Elapsed: 4 mins 59 secs
Command Line: /opt/maven3/bin/mvn --batch-mode --settings /srv/gump/public/workspace/apache-commons/vfs/gump_mvn_settings.xml
[Working Directory: /srv/gump/public/workspace/apache-commons/vfs]
M2_HOME: /opt/maven3
	at sun.reflect.NativeMethodAccessorImpl.invoke(
	at sun.reflect.DelegatingMethodAccessorImpl.invoke(
	at java.lang.reflect.Method.invoke(
	at org.apache.maven.surefire.util.ReflectionUtils.invokeMethodWithArray(
	at org.apache.maven.surefire.booter.ProviderFactory$ProviderProxy.invoke(
	at org.apache.maven.surefire.booter.ProviderFactory.invokeProvider(
	at org.apache.maven.surefire.booter.ForkedBooter.runSuitesInProcess(
	at org.apache.maven.surefire.booter.ForkedBooter.main(

Running org.apache.commons.vfs2.provider.https.test.GetContentInfoFunctionalTest
Tests run: 1, Failures: 0, Errors: 0, Skipped: 0, Time elapsed: 0.288 sec
Running org.apache.commons.vfs2.provider.temp.test.TemporaryProviderTestCase
Tests run: 73, Failures: 0, Errors: 0, Skipped: 0, Time elapsed: 4.81 sec
Running org.apache.commons.vfs2.FileExtensionSelectorTest
Tests run: 5, Failures: 0, Errors: 0, Skipped: 0, Time elapsed: 0.011 sec

Results :

Tests in error: 
(Permission denied)

Tests run: 1697, Failures: 0, Errors: 1, Skipped: 2

[INFO] ------------------------------------------------------------------------
[INFO] Reactor Summary:
[INFO] Commons VFS ....................................... SUCCESS [9.950s]
[INFO] Commons VFS Core .................................. FAILURE [4:45.160s]
[INFO] Commons VFS Examples .............................. SKIPPED
[INFO] Commons VFS Distribution .......................... SKIPPED
[INFO] ------------------------------------------------------------------------
[INFO] ------------------------------------------------------------------------
[INFO] Total time: 4:56.621s
[INFO] Finished at: Thu Jan 10 07:53:15 UTC 2013
[INFO] Final Memory: 28M/68M
[INFO] ------------------------------------------------------------------------
[ERROR] Failed to execute goal org.apache.maven.plugins:maven-surefire-plugin:2.12.3:test
(default-test) on project commons-vfs2: There are test failures.
[ERROR] Please refer to /srv/gump/public/workspace/apache-commons/vfs/core/target/surefire-reports
for the individual test results.
[ERROR] -> [Help 1]
[ERROR] To see the full stack trace of the errors, re-run Maven with the -e switch.
[ERROR] Re-run Maven using the -X switch to enable full debug logging.
[ERROR] For more information about the errors and possible solutions, please read the following
[ERROR] [Help 1]
[ERROR] After correcting the problems, you can resume the build with the command
[ERROR]   mvn <goals> -rf :commons-vfs2

To subscribe to this information via syndicated feeds:
- RSS:
- Atom:

============================== Gump Tracking Only ===
Produced by Apache Gump(TM) version 2.3.
Gump Run 12000010012013,
Gump E-mail Identifier (unique within run) #55.

Apache Gump [Instance: vmgump]

To unsubscribe, e-mail:
For additional commands, e-mail:

View raw message