commons-dev mailing list archives

Site index · List index
Message view « Date » · « Thread »
Top « Date » · « Thread »
From Gary Gregory <garydgreg...@gmail.com>
Subject Re: [VOTE] Release of commons-email-1.3 based on RC4
Date Tue, 11 Dec 2012 02:57:34 GMT
I downloaded the tag and ran "mvn clean site" and got 4 test failures:

Tests run: 14, Failures: 1, Errors: 0, Skipped: 0, Time elapsed: 4.902 sec
<<< FAILURE!
testEmbedUrl(org.apache.commons.mail.HtmlEmailTest)  Time elapsed: 4505
sec  <<< FAILURE!
junit.framework.AssertionFailedError: Should have thrown an exception
        at junit.framework.Assert.fail(Assert.java:57)
        at junit.framework.TestCase.fail(TestCase.java:227)
        at
org.apache.commons.mail.HtmlEmailTest.testEmbedUrl(HtmlEmailTest.java:181)
        at sun.reflect.NativeMethodAccessorImpl.invoke0(Native Method)
        at
sun.reflect.NativeMethodAccessorImpl.invoke(NativeMethodAccessorImpl.java:39)
        at
sun.reflect.DelegatingMethodAccessorImpl.invoke(DelegatingMethodAccessorImpl.java:25)
        at java.lang.reflect.Method.invoke(Method.java:597)
        at junit.framework.TestCase.runTest(TestCase.java:176)
        at junit.framework.TestCase.runBare(TestCase.java:141)
        at junit.framework.TestResult$1.protect(TestResult.java:122)
        at junit.framework.TestResult.runProtected(TestResult.java:142)
        at junit.framework.TestResult.run(TestResult.java:125)
        at junit.framework.TestCase.run(TestCase.java:129)
        at junit.framework.TestSuite.runTest(TestSuite.java:255)
        at junit.framework.TestSuite.run(TestSuite.java:250)
        at
org.junit.internal.runners.JUnit38ClassRunner.run(JUnit38ClassRunner.java:84)
        at
org.apache.maven.surefire.junit4.JUnit4Provider.execute(JUnit4Provider.java:252)
        at
org.apache.maven.surefire.junit4.JUnit4Provider.executeTestSet(JUnit4Provider.java:141)
        at
org.apache.maven.surefire.junit4.JUnit4Provider.invoke(JUnit4Provider.java:112)
        at sun.reflect.NativeMethodAccessorImpl.invoke0(Native Method)
        at
sun.reflect.NativeMethodAccessorImpl.invoke(NativeMethodAccessorImpl.java:39)
        at
sun.reflect.DelegatingMethodAccessorImpl.invoke(DelegatingMethodAccessorImpl.java:25)
        at java.lang.reflect.Method.invoke(Method.java:597)
        at
org.apache.maven.surefire.util.ReflectionUtils.invokeMethodWithArray(ReflectionUtils.java:189)
        at
org.apache.maven.surefire.booter.ProviderFactory$ProviderProxy.invoke(ProviderFactory.java:165)
        at
org.apache.maven.surefire.booter.ProviderFactory.invokeProvider(ProviderFactory.java:85)
        at
org.apache.maven.surefire.booter.ForkedBooter.runSuitesInProcess(ForkedBooter.java:115)
        at
org.apache.maven.surefire.booter.ForkedBooter.main(ForkedBooter.java:75)

Running org.apache.commons.mail.ImageHtmlEmailTest
Tests run: 22, Failures: 1, Errors: 0, Skipped: 0, Time elapsed: 19.008 sec
<<< FAILURE!
testEmbedUrl(org.apache.commons.mail.ImageHtmlEmailTest)  Time elapsed: 66
sec  <<< FAILURE!
junit.framework.AssertionFailedError: Should have thrown an exception
        at junit.framework.Assert.fail(Assert.java:57)
        at junit.framework.TestCase.fail(TestCase.java:227)
        at
org.apache.commons.mail.HtmlEmailTest.testEmbedUrl(HtmlEmailTest.java:181)
        at sun.reflect.NativeMethodAccessorImpl.invoke0(Native Method)
        at
sun.reflect.NativeMethodAccessorImpl.invoke(NativeMethodAccessorImpl.java:39)
        at
sun.reflect.DelegatingMethodAccessorImpl.invoke(DelegatingMethodAccessorImpl.java:25)
        at java.lang.reflect.Method.invoke(Method.java:597)
        at junit.framework.TestCase.runTest(TestCase.java:176)
        at junit.framework.TestCase.runBare(TestCase.java:141)
        at junit.framework.TestResult$1.protect(TestResult.java:122)
        at junit.framework.TestResult.runProtected(TestResult.java:142)
        at junit.framework.TestResult.run(TestResult.java:125)
        at junit.framework.TestCase.run(TestCase.java:129)
        at junit.framework.TestSuite.runTest(TestSuite.java:255)
        at junit.framework.TestSuite.run(TestSuite.java:250)
        at
org.junit.internal.runners.JUnit38ClassRunner.run(JUnit38ClassRunner.java:84)
        at
org.apache.maven.surefire.junit4.JUnit4Provider.execute(JUnit4Provider.java:252)
        at
org.apache.maven.surefire.junit4.JUnit4Provider.executeTestSet(JUnit4Provider.java:141)
        at
org.apache.maven.surefire.junit4.JUnit4Provider.invoke(JUnit4Provider.java:112)
        at sun.reflect.NativeMethodAccessorImpl.invoke0(Native Method)
        at
sun.reflect.NativeMethodAccessorImpl.invoke(NativeMethodAccessorImpl.java:39)
        at
sun.reflect.DelegatingMethodAccessorImpl.invoke(DelegatingMethodAccessorImpl.java:25)
        at java.lang.reflect.Method.invoke(Method.java:597)
        at
org.apache.maven.surefire.util.ReflectionUtils.invokeMethodWithArray(ReflectionUtils.java:189)
        at
org.apache.maven.surefire.booter.ProviderFactory$ProviderProxy.invoke(ProviderFactory.java:165)
        at
org.apache.maven.surefire.booter.ProviderFactory.invokeProvider(ProviderFactory.java:85)
        at
org.apache.maven.surefire.booter.ForkedBooter.runSuitesInProcess(ForkedBooter.java:115)
        at
org.apache.maven.surefire.booter.ForkedBooter.main(ForkedBooter.java:75)

Running org.apache.commons.mail.InvalidAddressTest
Tests run: 4, Failures: 0, Errors: 0, Skipped: 0, Time elapsed: 0.005 sec
Running org.apache.commons.mail.InvalidInternetAddressTest
Tests run: 3, Failures: 0, Errors: 0, Skipped: 0, Time elapsed: 0 sec
Running org.apache.commons.mail.MultiPartEmailTest
Tests run: 11, Failures: 2, Errors: 0, Skipped: 0, Time elapsed: 0.16 sec
<<< FAILURE!
testAttach3(org.apache.commons.mail.MultiPartEmailTest)  Time elapsed: 70
sec  <<< FAILURE!
junit.framework.AssertionFailedError: Should have thrown an exception
        at junit.framework.Assert.fail(Assert.java:57)
        at junit.framework.TestCase.fail(TestCase.java:227)
        at
org.apache.commons.mail.MultiPartEmailTest.testAttach3(MultiPartEmailTest.java:322)
        at sun.reflect.NativeMethodAccessorImpl.invoke0(Native Method)
        at
sun.reflect.NativeMethodAccessorImpl.invoke(NativeMethodAccessorImpl.java:39)
        at
sun.reflect.DelegatingMethodAccessorImpl.invoke(DelegatingMethodAccessorImpl.java:25)
        at java.lang.reflect.Method.invoke(Method.java:597)
        at junit.framework.TestCase.runTest(TestCase.java:176)
        at junit.framework.TestCase.runBare(TestCase.java:141)
        at junit.framework.TestResult$1.protect(TestResult.java:122)
        at junit.framework.TestResult.runProtected(TestResult.java:142)
        at junit.framework.TestResult.run(TestResult.java:125)
        at junit.framework.TestCase.run(TestCase.java:129)
        at junit.framework.TestSuite.runTest(TestSuite.java:255)
        at junit.framework.TestSuite.run(TestSuite.java:250)
        at
org.junit.internal.runners.JUnit38ClassRunner.run(JUnit38ClassRunner.java:84)
        at
org.apache.maven.surefire.junit4.JUnit4Provider.execute(JUnit4Provider.java:252)
        at
org.apache.maven.surefire.junit4.JUnit4Provider.executeTestSet(JUnit4Provider.java:141)
        at
org.apache.maven.surefire.junit4.JUnit4Provider.invoke(JUnit4Provider.java:112)
        at sun.reflect.NativeMethodAccessorImpl.invoke0(Native Method)
        at
sun.reflect.NativeMethodAccessorImpl.invoke(NativeMethodAccessorImpl.java:39)
        at
sun.reflect.DelegatingMethodAccessorImpl.invoke(DelegatingMethodAccessorImpl.java:25)
        at java.lang.reflect.Method.invoke(Method.java:597)
        at
org.apache.maven.surefire.util.ReflectionUtils.invokeMethodWithArray(ReflectionUtils.java:189)
        at
org.apache.maven.surefire.booter.ProviderFactory$ProviderProxy.invoke(ProviderFactory.java:165)
        at
org.apache.maven.surefire.booter.ProviderFactory.invokeProvider(ProviderFactory.java:85)
        at
org.apache.maven.surefire.booter.ForkedBooter.runSuitesInProcess(ForkedBooter.java:115)
        at
org.apache.maven.surefire.booter.ForkedBooter.main(ForkedBooter.java:75)

testAttach(org.apache.commons.mail.MultiPartEmailTest)  Time elapsed: 55
sec  <<< FAILURE!
junit.framework.AssertionFailedError: Should have thrown an exception
        at junit.framework.Assert.fail(Assert.java:57)
        at junit.framework.TestCase.fail(TestCase.java:227)
        at
org.apache.commons.mail.MultiPartEmailTest.testAttach(MultiPartEmailTest.java:246)
        at sun.reflect.NativeMethodAccessorImpl.invoke0(Native Method)
        at
sun.reflect.NativeMethodAccessorImpl.invoke(NativeMethodAccessorImpl.java:39)
        at
sun.reflect.DelegatingMethodAccessorImpl.invoke(DelegatingMethodAccessorImpl.java:25)
        at java.lang.reflect.Method.invoke(Method.java:597)
        at junit.framework.TestCase.runTest(TestCase.java:176)
        at junit.framework.TestCase.runBare(TestCase.java:141)
        at junit.framework.TestResult$1.protect(TestResult.java:122)
        at junit.framework.TestResult.runProtected(TestResult.java:142)
        at junit.framework.TestResult.run(TestResult.java:125)
        at junit.framework.TestCase.run(TestCase.java:129)
        at junit.framework.TestSuite.runTest(TestSuite.java:255)
        at junit.framework.TestSuite.run(TestSuite.java:250)
        at
org.junit.internal.runners.JUnit38ClassRunner.run(JUnit38ClassRunner.java:84)
        at
org.apache.maven.surefire.junit4.JUnit4Provider.execute(JUnit4Provider.java:252)
        at
org.apache.maven.surefire.junit4.JUnit4Provider.executeTestSet(JUnit4Provider.java:141)
        at
org.apache.maven.surefire.junit4.JUnit4Provider.invoke(JUnit4Provider.java:112)
        at sun.reflect.NativeMethodAccessorImpl.invoke0(Native Method)
        at
sun.reflect.NativeMethodAccessorImpl.invoke(NativeMethodAccessorImpl.java:39)
        at
sun.reflect.DelegatingMethodAccessorImpl.invoke(DelegatingMethodAccessorImpl.java:25)
        at java.lang.reflect.Method.invoke(Method.java:597)
        at
org.apache.maven.surefire.util.ReflectionUtils.invokeMethodWithArray(ReflectionUtils.java:189)
        at
org.apache.maven.surefire.booter.ProviderFactory$ProviderProxy.invoke(ProviderFactory.java:165)
        at
org.apache.maven.surefire.booter.ProviderFactory.invokeProvider(ProviderFactory.java:85)
        at
org.apache.maven.surefire.booter.ForkedBooter.runSuitesInProcess(ForkedBooter.java:115)
        at
org.apache.maven.surefire.booter.ForkedBooter.main(ForkedBooter.java:75)

My set up:

Apache Maven 3.0.4 (r1232337; 2012-01-17 03:44:56-0500)
Maven home: C:\Java\apache-maven-3.0.4\bin\..
Java version: 1.6.0_35, vendor: Sun Microsystems Inc.
Java home: C:\Program Files\Java\jdk1.6.0_35\jre
Default locale: en_US, platform encoding: Cp1252
OS name: "windows 7", version: "6.1", arch: "amd64", family: "windows"

Gary


On Mon, Dec 10, 2012 at 5:28 PM, Thomas Neidhart
<thomas.neidhart@gmail.com>wrote:

> Hi,
>
> I would like to call a vote from commons-email-1.3 based on RC4.
>
> The files:
>
> The artifacts are deployed to Nexus:
> https://repository.apache.org/content/repositories/orgapachecommons-135/
>
> The tag:
> http://svn.apache.org/viewvc/commons/proper/email/tags/EMAIL_1_3_RC4/
>
> The site:
> http://people.apache.org/builds/commons/email/1.3/RC4/
>
> Additional Notes:
>
> o the RC is binary compatible to commons-email-1.2 whereas the
>   remaining Clirr warnings stem from moving constants to an interface
>   and have already been verified to not break BC.
> o source / binary compatibility has been upgraded to JDK 1.5
>
> Please take a look at the commons-email-1.3 artifacts and vote!
>
> ------------------------------------------------
> [ ] +1 release it
> [ ] +0 go ahead I don't care
> [ ] -1 no, do not release it because
> ------------------------------------------------
>
> Vote will remain open for at least 72 hours.
>
> Thanks in advance,
>
> Thomas
>
> ---------------------------------------------------------------------
> To unsubscribe, e-mail: dev-unsubscribe@commons.apache.org
> For additional commands, e-mail: dev-help@commons.apache.org
>
>


-- 
E-Mail: garydgregory@gmail.com | ggregory@apache.org
JUnit in Action, 2nd Ed: <http://goog_1249600977>http://bit.ly/ECvg0
Spring Batch in Action: <http://s.apache.org/HOq>http://bit.ly/bqpbCK
Blog: http://garygregory.wordpress.com
Home: http://garygregory.com/
Tweet! http://twitter.com/GaryGregory

Mime
  • Unnamed multipart/alternative (inline, None, 0 bytes)
View raw message