commons-dev mailing list archives

Site index · List index
Message view « Date » · « Thread »
Top « Date » · « Thread »
From Gump <iss...@commons.apache.org>
Subject [GUMP@vmgump]: Project commons-chain2 (in module apache-commons) failed
Date Tue, 23 Oct 2012 11:16:17 GMT
To whom it may engage...
        
This is an automated request, but not an unsolicited one. For 
more information please visit http://gump.apache.org/nagged.html, 
and/or contact the folk at general@gump.apache.org.

Project commons-chain2 has an issue affecting its community integration.
This issue affects 1 projects,
 and has been outstanding for 165 runs.
The current state of this project is 'Failed', with reason 'Build Failed'.
For reference only, the following projects are affected by this:
    - commons-chain2 :  GoF "Chain of Responsibility" pattern


Full details are available at:
    http://vmgump.apache.org/gump/public/apache-commons/commons-chain2/index.html

That said, some information snippets are provided here.

The following annotations (debug/informational/warning/error messages) were provided:
 -DEBUG- Sole jar output [commons-chain2-*[0-9T].jar] identifier set to project name
 -DEBUG- Sole pom output [pom.xml] identifier set to project name
 -DEBUG- (Apache Gump generated) Apache Maven Settings in: /srv/gump/public/workspace/apache-commons/chain/gump_mvn_settings.xml
 -INFO- Failed with reason build failed
 -DEBUG- Maven POM in: /srv/gump/public/workspace/apache-commons/chain/pom.xml
 -INFO- Failed to extract fallback artifacts from Gump Repository



The following work was performed:
http://vmgump.apache.org/gump/public/apache-commons/commons-chain2/gump_work/build_apache-commons_commons-chain2.html
Work Name: build_apache-commons_commons-chain2 (Type: Build)
Work ended in a state of : Failed
Elapsed: 58 secs
Command Line: /opt/maven2/bin/mvn --batch-mode --settings /srv/gump/public/workspace/apache-commons/chain/gump_mvn_settings.xml
package 
[Working Directory: /srv/gump/public/workspace/apache-commons/chain]
M2_HOME: /opt/maven2
---------------------------------------------
	at org.apache.maven.surefire.junit4.JUnit4Provider.invoke(JUnit4Provider.java:113)
	at sun.reflect.NativeMethodAccessorImpl.invoke0(Native Method)
	at sun.reflect.NativeMethodAccessorImpl.invoke(NativeMethodAccessorImpl.java:57)
	at sun.reflect.DelegatingMethodAccessorImpl.invoke(DelegatingMethodAccessorImpl.java:43)
	at java.lang.reflect.Method.invoke(Method.java:601)
	at org.apache.maven.surefire.util.ReflectionUtils.invokeMethodWithArray(ReflectionUtils.java:189)
	at org.apache.maven.surefire.booter.ProviderFactory$ProviderProxy.invoke(ProviderFactory.java:165)
	at org.apache.maven.surefire.booter.ProviderFactory.invokeProvider(ProviderFactory.java:85)
	at org.apache.maven.surefire.booter.ForkedBooter.runSuitesInProcess(ForkedBooter.java:103)
	at org.apache.maven.surefire.booter.ForkedBooter.main(ForkedBooter.java:74)

Tests run: 10, Failures: 0, Errors: 9, Skipped: 0, Time elapsed: 0.135 sec <<< FAILURE!

Results :

Tests in error: 
  testExecute2a(org.apache.commons.chain2.config.ConfigParser2TestCase): org/apache/commons/beanutils/BeanUtils
  testExecute2b(org.apache.commons.chain2.config.ConfigParser2TestCase): org/apache/commons/beanutils/BeanUtils
  testExecute2c(org.apache.commons.chain2.config.ConfigParser2TestCase): org/apache/commons/beanutils/BeanUtils
  testExecute2d(org.apache.commons.chain2.config.ConfigParser2TestCase): org/apache/commons/beanutils/BeanUtils
  testExecute4a(org.apache.commons.chain2.config.ConfigParser2TestCase): org/apache/commons/beanutils/BeanUtils
  testExecute4b(org.apache.commons.chain2.config.ConfigParser2TestCase): org/apache/commons/beanutils/BeanUtils
  testExecute4c(org.apache.commons.chain2.config.ConfigParser2TestCase): org/apache/commons/beanutils/BeanUtils
  testExecute4d(org.apache.commons.chain2.config.ConfigParser2TestCase): org/apache/commons/beanutils/BeanUtils
  testDefault(org.apache.commons.chain2.config.ConfigParser2TestCase): org/apache/commons/beanutils/BeanUtils
  testExecute2a(org.apache.commons.chain2.config.ConfigParserTestCase): org/apache/commons/beanutils/BeanUtils
  testExecute2b(org.apache.commons.chain2.config.ConfigParserTestCase): org/apache/commons/beanutils/BeanUtils
  testExecute2c(org.apache.commons.chain2.config.ConfigParserTestCase): org/apache/commons/beanutils/BeanUtils
  testExecute2d(org.apache.commons.chain2.config.ConfigParserTestCase): org/apache/commons/beanutils/BeanUtils
  testExecute4a(org.apache.commons.chain2.config.ConfigParserTestCase): org/apache/commons/beanutils/BeanUtils
  testExecute4b(org.apache.commons.chain2.config.ConfigParserTestCase): org/apache/commons/beanutils/BeanUtils
  testExecute4c(org.apache.commons.chain2.config.ConfigParserTestCase): org/apache/commons/beanutils/BeanUtils
  testExecute4d(org.apache.commons.chain2.config.ConfigParserTestCase): org/apache/commons/beanutils/BeanUtils
  testDefault(org.apache.commons.chain2.config.ConfigParserTestCase): org/apache/commons/beanutils/BeanUtils

Tests run: 20, Failures: 0, Errors: 18, Skipped: 0

[INFO] ------------------------------------------------------------------------
[ERROR] BUILD FAILURE
[INFO] ------------------------------------------------------------------------
[INFO] There are test failures.

Please refer to /srv/gump/public/workspace/apache-commons/chain/configuration/xml/target/surefire-reports
for the individual test results.
[INFO] ------------------------------------------------------------------------
[INFO] For more information, run Maven with the -e switch
[INFO] ------------------------------------------------------------------------
[INFO] Total time: 57 seconds
[INFO] Finished at: Tue Oct 23 11:16:12 UTC 2012
[INFO] Final Memory: 76M/188M
[INFO] ------------------------------------------------------------------------
---------------------------------------------

To subscribe to this information via syndicated feeds:
- RSS: http://vmgump.apache.org/gump/public/apache-commons/commons-chain2/rss.xml
- Atom: http://vmgump.apache.org/gump/public/apache-commons/commons-chain2/atom.xml

============================== Gump Tracking Only ===
Produced by Apache Gump(TM) version 2.3.
Gump Run 06000623102012, vmgump.apache.org:vmgump:06000623102012
Gump E-mail Identifier (unique within run) #39.

--
Apache Gump
http://gump.apache.org/ [Instance: vmgump]

---------------------------------------------------------------------
To unsubscribe, e-mail: dev-unsubscribe@commons.apache.org
For additional commands, e-mail: dev-help@commons.apache.org


Mime
View raw message