commons-dev mailing list archives

Site index · List index
Message view « Date » · « Thread »
Top « Date » · « Thread »
From Gump <iss...@commons.apache.org>
Subject [GUMP@vmgump]: Project commons-vfs2 (in module apache-commons) failed
Date Mon, 10 Sep 2012 05:24:52 GMT
To whom it may engage...
        
This is an automated request, but not an unsolicited one. For 
more information please visit http://gump.apache.org/nagged.html, 
and/or contact the folk at general@gump.apache.org.

Project commons-vfs2 has an issue affecting its community integration.
This issue affects 5 projects.
The current state of this project is 'Failed', with reason 'Build Failed'.
For reference only, the following projects are affected by this:
    - commons-configuration :  Apache Commons
    - commons-configuration-test :  Apache Commons
    - commons-vfs2 :  Apache Commons
    - commons-vfs2-sandbox :  Apache Commons
    - commons-vfs2-test :  Apache Commons


Full details are available at:
    http://vmgump.apache.org/gump/public/apache-commons/commons-vfs2/index.html

That said, some information snippets are provided here.

The following annotations (debug/informational/warning/error messages) were provided:
 -DEBUG- Sole jar output [commons-vfs2-*[0-9T].jar] identifier set to project name
 -DEBUG- (Apache Gump generated) Apache Maven Settings in: /srv/gump/public/workspace/apache-commons/vfs/gump_mvn_settings.xml
 -INFO- Failed with reason build failed
 -DEBUG- Maven POM in: /srv/gump/public/workspace/apache-commons/vfs/pom.xml
 -INFO- Failed to extract fallback artifacts from Gump Repository



The following work was performed:
http://vmgump.apache.org/gump/public/apache-commons/commons-vfs2/gump_work/build_apache-commons_commons-vfs2.html
Work Name: build_apache-commons_commons-vfs2 (Type: Build)
Work ended in a state of : Failed
Elapsed: 31 secs
Command Line: /opt/maven3/bin/mvn --batch-mode -DskipTests=true --settings /srv/gump/public/workspace/apache-commons/vfs/gump_mvn_settings.xml
package 
[Working Directory: /srv/gump/public/workspace/apache-commons/vfs]
M2_HOME: /opt/maven3
---------------------------------------------
Downloading: http://localhost:8192/maven2/xerces/xercesImpl/2.8.1/xercesImpl-2.8.1.jar
Downloaded: http://localhost:8192/maven2/org/fontbox/fontbox/0.1.0/fontbox-0.1.0.jar (62 KB
at 142.4 KB/sec)
Downloading: http://localhost:8192/maven2/xml-apis/xml-apis/1.3.03/xml-apis-1.3.03.jar
Downloaded: http://localhost:8192/maven2/xml-apis/xml-apis/1.3.03/xml-apis-1.3.03.jar (229
KB at 7149.9 KB/sec)
Downloaded: http://localhost:8192/maven2/org/jempbox/jempbox/0.2.0/jempbox-0.2.0.jar (42 KB
at 110.5 KB/sec)
Downloading: http://localhost:8192/maven2/org/apache/jackrabbit/jackrabbit-jcr-servlet/1.5.2/jackrabbit-jcr-servlet-1.5.2.jar
Downloading: http://localhost:8192/maven2/org/apache/jackrabbit/jackrabbit-jcr-rmi/1.5.0/jackrabbit-jcr-rmi-1.5.0.jar
Downloaded: http://localhost:8192/maven2/xerces/xercesImpl/2.8.1/xercesImpl-2.8.1.jar (1420
KB at 17745.9 KB/sec)
Downloading: http://localhost:8192/maven2/org/slf4j/jcl-over-slf4j/1.5.5/jcl-over-slf4j-1.5.5.jar
Downloaded: http://localhost:8192/maven2/net/sourceforge/nekohtml/nekohtml/1.9.7/nekohtml-1.9.7.jar
(112 KB at 416.0 KB/sec)
Downloading: http://localhost:8192/maven2/org/mortbay/jetty/jetty/6.1.14/jetty-6.1.14.jar
Downloaded: http://localhost:8192/maven2/org/mortbay/jetty/jetty/6.1.14/jetty-6.1.14.jar (526
KB at 26297.9 KB/sec)
Downloading: http://localhost:8192/maven2/org/mortbay/jetty/jsp-2.1/6.1.14/jsp-2.1-6.1.14.jar
Downloaded: http://localhost:8192/maven2/org/apache/jackrabbit/jackrabbit-jcr-server/1.6.5/jackrabbit-jcr-server-1.6.5.jar
(297 KB at 444.6 KB/sec)
Downloading: http://localhost:8192/maven2/org/eclipse/jdt/core/3.1.1/core-3.1.1.jar
Downloaded: http://localhost:8192/maven2/org/apache/jackrabbit/jackrabbit-jcr-servlet/1.5.2/jackrabbit-jcr-servlet-1.5.2.jar
(30 KB at 51.7 KB/sec)
Downloading: http://localhost:8192/maven2/org/mortbay/jetty/jetty-util/6.1.14/jetty-util-6.1.14.jar
Downloaded: http://localhost:8192/maven2/org/mortbay/jetty/jetty-util/6.1.14/jetty-util-6.1.14.jar
(174 KB at 14418.5 KB/sec)
Downloading: http://localhost:8192/maven2/org/mortbay/jetty/servlet-api-2.5/6.1.14/servlet-api-2.5-6.1.14.jar
Downloaded: http://localhost:8192/maven2/org/slf4j/jcl-over-slf4j/1.5.5/jcl-over-slf4j-1.5.5.jar
(17 KB at 30.2 KB/sec)
Downloading: http://localhost:8192/maven2/org/mortbay/jetty/jsp-api-2.1/6.1.14/jsp-api-2.1-6.1.14.jar
Downloaded: http://localhost:8192/maven2/org/mortbay/jetty/jsp-2.1/6.1.14/jsp-2.1-6.1.14.jar
(1001 KB at 1931.8 KB/sec)
Downloaded: http://localhost:8192/maven2/org/mortbay/jetty/jsp-api-2.1/6.1.14/jsp-api-2.1-6.1.14.jar
(132 KB at 1045.6 KB/sec)
Downloaded: http://localhost:8192/maven2/org/mortbay/jetty/servlet-api-2.5/6.1.14/servlet-api-2.5-6.1.14.jar
(130 KB at 923.3 KB/sec)
Downloaded: http://localhost:8192/maven2/org/eclipse/jdt/core/3.1.1/core-3.1.1.jar (3484 KB
at 17681.5 KB/sec)
Downloaded: http://localhost:8192/maven2/org/apache/jackrabbit/jackrabbit-jcr-rmi/1.5.0/jackrabbit-jcr-rmi-1.5.0.jar
(226 KB at 296.2 KB/sec)
[INFO] ------------------------------------------------------------------------
[INFO] Reactor Summary:
[INFO] 
[INFO] Commons VFS ....................................... SUCCESS [10.420s]
[INFO] Commons VFS Core .................................. FAILURE [17.089s]
[INFO] Commons VFS Examples .............................. SKIPPED
[INFO] Commons VFS Distribution .......................... SKIPPED
[INFO] ------------------------------------------------------------------------
[INFO] BUILD FAILURE
[INFO] ------------------------------------------------------------------------
[INFO] Total time: 28.779s
[INFO] Finished at: Mon Sep 10 05:24:52 UTC 2012
[INFO] Final Memory: 16M/39M
[INFO] ------------------------------------------------------------------------
[ERROR] Failed to execute goal on project commons-vfs2: Could not resolve dependencies for
project org.apache.commons:commons-vfs2:jar:2.1-SNAPSHOT: Could not transfer artifact org.apache.jackrabbit:jackrabbit-jcr-commons:jar:1.6.5
from/to gump-central (http://localhost:8192/maven2): Error transferring file: Invalid Http
response -> [Help 1]
[ERROR] 
[ERROR] To see the full stack trace of the errors, re-run Maven with the -e switch.
[ERROR] Re-run Maven using the -X switch to enable full debug logging.
[ERROR] 
[ERROR] For more information about the errors and possible solutions, please read the following
articles:
[ERROR] [Help 1] http://cwiki.apache.org/confluence/display/MAVEN/DependencyResolutionException
[ERROR] 
[ERROR] After correcting the problems, you can resume the build with the command
[ERROR]   mvn <goals> -rf :commons-vfs2
---------------------------------------------

To subscribe to this information via syndicated feeds:
- RSS: http://vmgump.apache.org/gump/public/apache-commons/commons-vfs2/rss.xml
- Atom: http://vmgump.apache.org/gump/public/apache-commons/commons-vfs2/atom.xml

============================== Gump Tracking Only ===
Produced by Apache Gump(TM) version 2.3.
Gump Run 14000010092012, vmgump.apache.org:vmgump:14000010092012
Gump E-mail Identifier (unique within run) #57.

--
Apache Gump
http://gump.apache.org/ [Instance: vmgump]

---------------------------------------------------------------------
To unsubscribe, e-mail: dev-unsubscribe@commons.apache.org
For additional commands, e-mail: dev-help@commons.apache.org


Mime
View raw message