commons-dev mailing list archives

Site index · List index
Message view « Date » · « Thread »
Top « Date » · « Thread »
From Gump <>
Subject [GUMP@vmgump]: Project commons-vfs2 (in module apache-commons) failed
Date Sun, 09 Sep 2012 04:48:57 GMT
To whom it may engage...
This is an automated request, but not an unsolicited one. For 
more information please visit, 
and/or contact the folk at

Project commons-vfs2 has an issue affecting its community integration.
This issue affects 5 projects.
The current state of this project is 'Failed', with reason 'Build Failed'.
For reference only, the following projects are affected by this:
    - commons-configuration :  Apache Commons
    - commons-configuration-test :  Apache Commons
    - commons-vfs2 :  Apache Commons
    - commons-vfs2-sandbox :  Apache Commons
    - commons-vfs2-test :  Apache Commons

Full details are available at:

That said, some information snippets are provided here.

The following annotations (debug/informational/warning/error messages) were provided:
 -DEBUG- Sole jar output [commons-vfs2-*[0-9T].jar] identifier set to project name
 -INFO- Optional dependency org.jdom prerequisite failed with reason build failed
 -DEBUG- (Apache Gump generated) Apache Maven Settings in: /srv/gump/public/workspace/apache-commons/vfs/gump_mvn_settings.xml
 -INFO- Failed with reason build failed
 -DEBUG- Maven POM in: /srv/gump/public/workspace/apache-commons/vfs/pom.xml
 -INFO- Failed to extract fallback artifacts from Gump Repository

The following work was performed:
Work Name: build_apache-commons_commons-vfs2 (Type: Build)
Work ended in a state of : Failed
Elapsed: 12 secs
Command Line: /opt/maven3/bin/mvn --batch-mode -DskipTests=true --settings /srv/gump/public/workspace/apache-commons/vfs/gump_mvn_settings.xml
[Working Directory: /srv/gump/public/workspace/apache-commons/vfs]
M2_HOME: /opt/maven3
[INFO] Commons VFS
[INFO] Commons VFS Core
[INFO] Commons VFS Examples
[INFO] Commons VFS Distribution
[INFO] ------------------------------------------------------------------------
[INFO] Building Commons VFS 2.1-SNAPSHOT
[INFO] ------------------------------------------------------------------------
[INFO] --- maven-antrun-plugin:1.7:run (javadoc.resources) @ commons-vfs2-project ---
[INFO] Executing tasks

     [copy] Copying 2 files to /srv/gump/public/workspace/apache-commons/vfs/target/apidocs/META-INF
[INFO] Executed tasks
[INFO] --- maven-antrun-plugin:1.7:run (vfs-jar-manifest) @ commons-vfs2-project ---
[INFO] Executing tasks

    [mkdir] Created dir: /srv/gump/public/workspace/apache-commons/vfs/target/osgi
    [touch] Creating /srv/gump/public/workspace/apache-commons/vfs/target/osgi/MANIFEST.MF
[INFO] Executed tasks
[INFO] --- maven-remote-resources-plugin:1.3:process (default) @ commons-vfs2-project ---
[INFO] --- buildnumber-maven-plugin:1.1:create (default) @ commons-vfs2-project ---
Downloading: http://localhost:8192/maven2/org/apache/maven/scm/maven-scm-provider-cvs-commons/1.7/maven-scm-provider-cvs-commons-1.7.pom
[INFO] ------------------------------------------------------------------------
[INFO] Reactor Summary:
[INFO] Commons VFS ....................................... FAILURE [8.619s]
[INFO] Commons VFS Core .................................. SKIPPED
[INFO] Commons VFS Examples .............................. SKIPPED
[INFO] Commons VFS Distribution .......................... SKIPPED
[INFO] ------------------------------------------------------------------------
[INFO] ------------------------------------------------------------------------
[INFO] Total time: 9.882s
[INFO] Finished at: Sun Sep 09 04:48:56 UTC 2012
[INFO] Final Memory: 10M/27M
[INFO] ------------------------------------------------------------------------
[ERROR] Failed to execute goal org.codehaus.mojo:buildnumber-maven-plugin:1.1:create (default)
on project commons-vfs2-project: Execution default of goal org.codehaus.mojo:buildnumber-maven-plugin:1.1:create
failed: Plugin org.codehaus.mojo:buildnumber-maven-plugin:1.1 or one of its dependencies could
not be resolved: Failed to collect dependencies for org.codehaus.mojo:buildnumber-maven-plugin:jar:1.1
(): Failed to read artifact descriptor for org.apache.maven.scm:maven-scm-provider-cvs-commons:jar:1.7:
Could not transfer artifact org.apache.maven.scm:maven-scm-provider-cvs-commons:pom:1.7 from/to
gump-central (http://localhost:8192/maven2): Error transferring file: Invalid Http response
-> [Help 1]
[ERROR] To see the full stack trace of the errors, re-run Maven with the -e switch.
[ERROR] Re-run Maven using the -X switch to enable full debug logging.
[ERROR] For more information about the errors and possible solutions, please read the following
[ERROR] [Help 1]

To subscribe to this information via syndicated feeds:
- RSS:
- Atom:

============================== Gump Tracking Only ===
Produced by Apache Gump(TM) version 2.3.
Gump Run 12000009092012,
Gump E-mail Identifier (unique within run) #46.

Apache Gump [Instance: vmgump]

To unsubscribe, e-mail:
For additional commands, e-mail:

View raw message