commons-dev mailing list archives

Site index · List index
Message view « Date » · « Thread »
Top « Date » · « Thread »
From Gary Gregory <garydgreg...@gmail.com>
Subject Re: [GUMP@vmgump]: Project commons-vfs2-sandbox (in module apache-commons) failed
Date Tue, 14 Aug 2012 13:35:57 GMT
This is weird, it looks like Gump uses Oracle Java 1.7.0_05.

I get no compile errors with:

Apache Maven 3.0.4 (r1232337; 2012-01-17 03:44:56-0500)
Maven home: C:\Java\apache-maven-3.0.4\bin\..
Java version: 1.7.0_05, vendor: Oracle Corporation
Java home: C:\Program Files\Java\jdk1.7.0_05\jre
Default locale: en_US, platform encoding: Cp1252
OS name: "windows 7", version: "6.1", arch: "amd64", family: "windows"

Thoughts?

Gary

On Tue, Aug 14, 2012 at 7:52 AM, Gump <issues@commons.apache.org> wrote:

> To whom it may engage...
>
> This is an automated request, but not an unsolicited one. For
> more information please visit http://gump.apache.org/nagged.html,
> and/or contact the folk at general@gump.apache.org.
>
> Project commons-vfs2-sandbox has an issue affecting its community
> integration.
> This issue affects 1 projects,
>  and has been outstanding for 12 runs.
> The current state of this project is 'Failed', with reason 'Build Failed'.
> For reference only, the following projects are affected by this:
>     - commons-vfs2-sandbox :  Apache Commons
>
>
> Full details are available at:
>
> http://vmgump.apache.org/gump/public/apache-commons/commons-vfs2-sandbox/index.html
>
> That said, some information snippets are provided here.
>
> The following annotations (debug/informational/warning/error messages)
> were provided:
>  -DEBUG- Sole jar output [commons-vfs2-sandbox-*[0-9T].jar] identifier set
> to project name
>  -INFO- Made directory
> [/srv/gump/public/workspace/apache-commons/vfs/sandbox/target/classes]
>  -INFO- Made directory
> [/srv/gump/public/workspace/apache-commons/vfs/sandbow/target/test-classes]
>  -DEBUG- (Apache Gump generated) Apache Maven Settings in:
> /srv/gump/public/workspace/apache-commons/vfs/sandbox/gump_mvn_settings.xml
>  -INFO- Failed with reason build failed
>  -DEBUG- Maven POM in:
> /srv/gump/public/workspace/apache-commons/vfs/sandbox/pom.xml
>  -INFO- Failed to extract fallback artifacts from Gump Repository
>
>
>
> The following work was performed:
>
> http://vmgump.apache.org/gump/public/apache-commons/commons-vfs2-sandbox/gump_work/build_apache-commons_commons-vfs2-sandbox.html
> Work Name: build_apache-commons_commons-vfs2-sandbox (Type: Build)
> Work ended in a state of : Failed
> Elapsed: 15 secs
> Command Line: /opt/maven3/bin/mvn --batch-mode --settings
> /srv/gump/public/workspace/apache-commons/vfs/sandbox/gump_mvn_settings.xml
> package
> [Working Directory: /srv/gump/public/workspace/apache-commons/vfs/sandbox]
> M2_HOME: /opt/maven3
> ---------------------------------------------
> [INFO] Executing tasks
>
> main:
>     [mkdir] Created dir:
> /srv/gump/public/workspace/apache-commons/vfs/sandbox/target/osgi
>     [touch] Creating
> /srv/gump/public/workspace/apache-commons/vfs/sandbox/target/osgi/MANIFEST.MF
> [INFO] Executed tasks
> [INFO]
> [INFO] --- maven-remote-resources-plugin:1.2.1:process (default) @
> commons-vfs2-sandbox ---
> [INFO]
> [INFO] --- buildnumber-maven-plugin:1.0:create (default) @
> commons-vfs2-sandbox ---
> [INFO] Checking for local modifications: skipped.
> [INFO] Updating project files from SCM: skipped.
> [INFO] Executing: /bin/sh -c cd
> /srv/gump/public/workspace/apache-commons/vfs/sandbox && svn
> --non-interactive info
> [INFO] Working directory:
> /srv/gump/public/workspace/apache-commons/vfs/sandbox
> [INFO] Storing buildNumber: ?????? at timestamp: 1344945157291
> [INFO] Executing: /bin/sh -c cd
> /srv/gump/public/workspace/apache-commons/vfs/sandbox && svn
> --non-interactive info
> [INFO] Working directory:
> /srv/gump/public/workspace/apache-commons/vfs/sandbox
> [INFO] Storing buildScmBranch: UNKNOWN_BRANCH
> [INFO]
> [INFO] --- maven-resources-plugin:2.5:resources (default-resources) @
> commons-vfs2-sandbox ---
> [debug] execute contextualize
> [INFO] Using 'UTF-8' encoding to copy filtered resources.
> [INFO] Copying 2 resources to META-INF
> [INFO]
> [INFO] --- maven-compiler-plugin:2.3.2:compile (default-compile) @
> commons-vfs2-sandbox ---
> [INFO] Compiling 14 source files to
> /srv/gump/public/workspace/apache-commons/vfs/sandbox/target/classes
> [INFO] -------------------------------------------------------------
> [ERROR] COMPILATION ERROR :
> [INFO] -------------------------------------------------------------
> [ERROR]
> /srv/gump/public/workspace/apache-commons/vfs/sandbox/src/main/java/org/apache/commons/vfs2/provider/smb/SmbFileObject.java:[45,7]
> error: Comparable cannot be inherited with different arguments:
> <org.apache.commons.vfs2.FileObject> and <>
> [ERROR]
> /srv/gump/public/workspace/apache-commons/vfs/sandbox/src/main/java/org/apache/commons/vfs2/provider/mime/MimeFileObject.java:[48,7]
> error: Comparable cannot be inherited with different arguments:
> <org.apache.commons.vfs2.FileObject> and <>
> [INFO] 2 errors
> [INFO] -------------------------------------------------------------
> [INFO]
> ------------------------------------------------------------------------
> [INFO] BUILD FAILURE
> [INFO]
> ------------------------------------------------------------------------
> [INFO] Total time: 12.496s
> [INFO] Finished at: Tue Aug 14 11:52:40 UTC 2012
> [INFO] Final Memory: 15M/45M
> [INFO]
> ------------------------------------------------------------------------
> [ERROR] Failed to execute goal
> org.apache.maven.plugins:maven-compiler-plugin:2.3.2:compile
> (default-compile) on project commons-vfs2-sandbox: Compilation failure:
> Compilation failure:
> [ERROR]
> /srv/gump/public/workspace/apache-commons/vfs/sandbox/src/main/java/org/apache/commons/vfs2/provider/smb/SmbFileObject.java:[45,7]
> error: Comparable cannot be inherited with different arguments:
> <org.apache.commons.vfs2.FileObject> and <>
> [ERROR]
> /srv/gump/public/workspace/apache-commons/vfs/sandbox/src/main/java/org/apache/commons/vfs2/provider/mime/MimeFileObject.java:[48,7]
> error: Comparable cannot be inherited with different arguments:
> <org.apache.commons.vfs2.FileObject> and <>
> [ERROR] -> [Help 1]
> [ERROR]
> [ERROR] To see the full stack trace of the errors, re-run Maven with the
> -e switch.
> [ERROR] Re-run Maven using the -X switch to enable full debug logging.
> [ERROR]
> [ERROR] For more information about the errors and possible solutions,
> please read the following articles:
> [ERROR] [Help 1]
> http://cwiki.apache.org/confluence/display/MAVEN/MojoFailureException
> ---------------------------------------------
>
> To subscribe to this information via syndicated feeds:
> - RSS:
> http://vmgump.apache.org/gump/public/apache-commons/commons-vfs2-sandbox/rss.xml
> - Atom:
> http://vmgump.apache.org/gump/public/apache-commons/commons-vfs2-sandbox/atom.xml
>
> ============================== Gump Tracking Only ===
> Produced by Apache Gump(TM) version 2.3.
> Gump Run 06000614082012, vmgump.apache.org:vmgump:06000614082012
> Gump E-mail Identifier (unique within run) #56.
>
> --
> Apache Gump
> http://gump.apache.org/ [Instance: vmgump]
>
> ---------------------------------------------------------------------
> To unsubscribe, e-mail: dev-unsubscribe@commons.apache.org
> For additional commands, e-mail: dev-help@commons.apache.org
>
>


-- 
E-Mail: garydgregory@gmail.com | ggregory@apache.org
JUnit in Action, 2nd Ed: <http://goog_1249600977>http://bit.ly/ECvg0
Spring Batch in Action: <http://s.apache.org/HOq>http://bit.ly/bqpbCK
Blog: http://garygregory.wordpress.com
Home: http://garygregory.com/
Tweet! http://twitter.com/GaryGregory

Mime
  • Unnamed multipart/alternative (inline, None, 0 bytes)
View raw message