commons-dev mailing list archives

Site index · List index
Message view « Date » · « Thread »
Top « Date » · « Thread »
From Gump <iss...@commons.apache.org>
Subject [GUMP@vmgump]: Project commons-logging-test (in module apache-commons) failed
Date Thu, 02 Aug 2012 01:44:19 GMT
To whom it may engage...
        
This is an automated request, but not an unsolicited one. For 
more information please visit http://gump.apache.org/nagged.html, 
and/or contact the folk at general@gump.apache.org.

Project commons-logging-test has an issue affecting its community integration.
This issue affects 1 projects.
The current state of this project is 'Failed', with reason 'Build Failed'.
For reference only, the following projects are affected by this:
    - commons-logging-test :  Apache Commons


Full details are available at:
    http://vmgump.apache.org/gump/public/apache-commons/commons-logging-test/index.html

That said, some information snippets are provided here.

The following annotations (debug/informational/warning/error messages) were provided:
 -DEBUG- (Apache Gump generated) Apache Maven Settings in: /srv/gump/public/workspace/apache-commons/logging/gump_mvn_settings.xml
 -INFO- Failed with reason build failed
 -DEBUG- Maven POM in: /srv/gump/public/workspace/apache-commons/logging/pom.xml
 -INFO- Project Reports in: /srv/gump/public/workspace/apache-commons/logging/target/surefire-reports



The following work was performed:
http://vmgump.apache.org/gump/public/apache-commons/commons-logging-test/gump_work/build_apache-commons_commons-logging-test.html
Work Name: build_apache-commons_commons-logging-test (Type: Build)
Work ended in a state of : Failed
Elapsed: 48 secs
Command Line: /opt/maven2/bin/mvn --batch-mode --settings /srv/gump/public/workspace/apache-commons/logging/gump_mvn_settings.xml
test 
[Working Directory: /srv/gump/public/workspace/apache-commons/logging]
M2_HOME: /opt/maven2
---------------------------------------------
[INFO] [compiler:testCompile {execution: default-testCompile}]
[INFO] Compiling 52 source files to /srv/gump/public/workspace/apache-commons/logging/target/test-classes
Downloading: http://localhost:8192/maven2/org/apache/maven/surefire/surefire-booter/2.9/surefire-booter-2.9.pom
2K downloaded  (surefire-booter-2.9.pom)
Downloading: http://localhost:8192/maven2/org/apache/maven/surefire/surefire-api/2.9/surefire-api-2.9.pom
2K downloaded  (surefire-api-2.9.pom)
Downloading: http://localhost:8192/maven2/org/apache/maven/surefire/maven-surefire-common/2.9/maven-surefire-common-2.9.pom
3K downloaded  (maven-surefire-common-2.9.pom)
Downloading: http://localhost:8192/maven2/org/apache/maven/surefire/surefire-booter/2.9/surefire-booter-2.9.jar
32K downloaded  (surefire-booter-2.9.jar)
Downloading: http://localhost:8192/maven2/org/apache/maven/surefire/surefire-api/2.9/surefire-api-2.9.jar
155K downloaded  (surefire-api-2.9.jar)
Downloading: http://localhost:8192/maven2/org/apache/maven/surefire/maven-surefire-common/2.9/maven-surefire-common-2.9.jar
59K downloaded  (maven-surefire-common-2.9.jar)
[INFO] [surefire:test {execution: default-test}]
[INFO] Surefire report directory: /srv/gump/public/workspace/apache-commons/logging/target/surefire-reports
Downloading: http://localhost:8192/maven2/org/apache/maven/surefire/surefire-junit3/2.9/surefire-junit3-2.9.pom
1K downloaded  (surefire-junit3-2.9.pom)
Downloading: http://localhost:8192/maven2/org/apache/maven/surefire/surefire-providers/2.9/surefire-providers-2.9.pom
2K downloaded  (surefire-providers-2.9.pom)
Downloading: http://localhost:8192/maven2/org/apache/maven/surefire/surefire-junit3/2.9/surefire-junit3-2.9.jar
25K downloaded  (surefire-junit3-2.9.jar)

-------------------------------------------------------
 T E S T S
-------------------------------------------------------
Running org.apache.commons.logging.avalon.AvalonLoggerTestCase
Tests run: 1, Failures: 0, Errors: 0, Skipped: 0, Time elapsed: 0.026 sec
Running org.apache.commons.logging.WeakHashTableTestCase
Tests run: 1, Failures: 1, Errors: 0, Skipped: 0, Time elapsed: 9.618 sec <<< FAILURE!

Results :

Failed tests:   testLOGGING_119(org.apache.commons.logging.WeakHashTableTestCase): Attempt:
299 Stuck threads: 10

Tests run: 2, Failures: 1, Errors: 0, Skipped: 0

[INFO] ------------------------------------------------------------------------
[ERROR] BUILD FAILURE
[INFO] ------------------------------------------------------------------------
[INFO] There are test failures.

Please refer to /srv/gump/public/workspace/apache-commons/logging/target/surefire-reports
for the individual test results.
[INFO] ------------------------------------------------------------------------
[INFO] For more information, run Maven with the -e switch
[INFO] ------------------------------------------------------------------------
[INFO] Total time: 47 seconds
[INFO] Finished at: Thu Aug 02 01:44:17 UTC 2012
[INFO] Final Memory: 38M/90M
[INFO] ------------------------------------------------------------------------
---------------------------------------------

To subscribe to this information via syndicated feeds:
- RSS: http://vmgump.apache.org/gump/public/apache-commons/commons-logging-test/rss.xml
- Atom: http://vmgump.apache.org/gump/public/apache-commons/commons-logging-test/atom.xml

============================== Gump Tracking Only ===
Produced by Apache Gump(TM) version 2.3.
Gump Run 11000002082012, vmgump.apache.org:vmgump:11000002082012
Gump E-mail Identifier (unique within run) #11.

--
Apache Gump
http://gump.apache.org/ [Instance: vmgump]

---------------------------------------------------------------------
To unsubscribe, e-mail: dev-unsubscribe@commons.apache.org
For additional commands, e-mail: dev-help@commons.apache.org


Mime
View raw message