commons-dev mailing list archives

Site index · List index
Message view « Date » · « Thread »
Top « Date » · « Thread »
From Gump <iss...@commons.apache.org>
Subject [GUMP@vmgump]: Project commons-chain2 (in module apache-commons) failed
Date Sat, 28 Jul 2012 04:18:30 GMT
To whom it may engage...
        
This is an automated request, but not an unsolicited one. For 
more information please visit http://gump.apache.org/nagged.html, 
and/or contact the folk at general@gump.apache.org.

Project commons-chain2 has an issue affecting its community integration.
This issue affects 1 projects,
 and has been outstanding for 2 runs.
The current state of this project is 'Failed', with reason 'Build Failed'.
For reference only, the following projects are affected by this:
    - commons-chain2 :  GoF "Chain of Responsibility" pattern


Full details are available at:
    http://vmgump.apache.org/gump/public/apache-commons/commons-chain2/index.html

That said, some information snippets are provided here.

The following annotations (debug/informational/warning/error messages) were provided:
 -DEBUG- Sole jar output [commons-chain2-*[0-9T].jar] identifier set to project name
 -DEBUG- Sole pom output [pom.xml] identifier set to project name
 -DEBUG- (Apache Gump generated) Apache Maven Settings in: /srv/gump/public/workspace/apache-commons/chain/gump_mvn_settings.xml
 -INFO- Failed with reason build failed
 -DEBUG- Maven POM in: /srv/gump/public/workspace/apache-commons/chain/pom.xml
 -INFO- Failed to extract fallback artifacts from Gump Repository



The following work was performed:
http://vmgump.apache.org/gump/public/apache-commons/commons-chain2/gump_work/build_apache-commons_commons-chain2.html
Work Name: build_apache-commons_commons-chain2 (Type: Build)
Work ended in a state of : Failed
Elapsed: 20 secs
Command Line: /opt/maven2/bin/mvn --batch-mode --settings /srv/gump/public/workspace/apache-commons/chain/gump_mvn_settings.xml
package 
[Working Directory: /srv/gump/public/workspace/apache-commons/chain]
M2_HOME: /opt/maven2
---------------------------------------------
[INFO] [jar:jar {execution: default-jar}]
[INFO] Building jar: /srv/gump/public/workspace/apache-commons/chain/build-tools/target/commons-chain2-build-tools-2.0-SNAPSHOT.jar
[INFO] ------------------------------------------------------------------------
[INFO] Building Apache Commons Chain :: Core
[INFO]    task-segment: [package]
[INFO] ------------------------------------------------------------------------
[INFO] [antrun:run {execution: javadoc.resources}]
[INFO] Executing tasks

main:
[INFO] Executed tasks
[INFO] [remote-resources:process {execution: default}]
[INFO] [buildnumber:create {execution: default}]
[INFO] Checking for local modifications: skipped.
[INFO] Updating project files from SCM: skipped.
[INFO] Executing: /bin/sh -c cd /srv/gump/public/workspace/apache-commons/chain/core &&
svn --non-interactive info
[INFO] Working directory: /srv/gump/public/workspace/apache-commons/chain/core
[INFO] Storing buildNumber: ?????? at timestamp: 1343449106552
[INFO] Executing: /bin/sh -c cd /srv/gump/public/workspace/apache-commons/chain/core &&
svn --non-interactive info
[INFO] Working directory: /srv/gump/public/workspace/apache-commons/chain/core
[INFO] Storing buildScmBranch: UNKNOWN_BRANCH
[debug] execute contextualize
[INFO] [resources:resources {execution: default-resources}]
[INFO] Using 'iso-8859-1' encoding to copy filtered resources.
[INFO] Copying 2 resources to META-INF
[INFO] [compiler:compile {execution: default-compile}]
[INFO] Compiling 28 source files to /srv/gump/public/workspace/apache-commons/chain/core/target/classes
[INFO] -------------------------------------------------------------
[ERROR] COMPILATION ERROR : 
[INFO] -------------------------------------------------------------
[ERROR] /srv/gump/public/workspace/apache-commons/chain/core/src/main/java/org/apache/commons/chain2/ChainConfigurationException.java:[43,8]
cannot find symbol
symbol  : constructor RuntimeException(java.lang.String,java.lang.Throwable,boolean,boolean)
location: class java.lang.RuntimeException
[INFO] 1 error
[INFO] -------------------------------------------------------------
[INFO] ------------------------------------------------------------------------
[ERROR] BUILD FAILURE
[INFO] ------------------------------------------------------------------------
[INFO] Compilation failure
/srv/gump/public/workspace/apache-commons/chain/core/src/main/java/org/apache/commons/chain2/ChainConfigurationException.java:[43,8]
cannot find symbol
symbol  : constructor RuntimeException(java.lang.String,java.lang.Throwable,boolean,boolean)
location: class java.lang.RuntimeException

[INFO] ------------------------------------------------------------------------
[INFO] For more information, run Maven with the -e switch
[INFO] ------------------------------------------------------------------------
[INFO] Total time: 19 seconds
[INFO] Finished at: Sat Jul 28 04:18:29 UTC 2012
[INFO] Final Memory: 61M/146M
[INFO] ------------------------------------------------------------------------
---------------------------------------------

To subscribe to this information via syndicated feeds:
- RSS: http://vmgump.apache.org/gump/public/apache-commons/commons-chain2/rss.xml
- Atom: http://vmgump.apache.org/gump/public/apache-commons/commons-chain2/atom.xml

============================== Gump Tracking Only ===
Produced by Apache Gump(TM) version 2.3.
Gump Run 13000028072012, vmgump.apache.org:vmgump:13000028072012
Gump E-mail Identifier (unique within run) #30.

--
Apache Gump
http://gump.apache.org/ [Instance: vmgump]

---------------------------------------------------------------------
To unsubscribe, e-mail: dev-unsubscribe@commons.apache.org
For additional commands, e-mail: dev-help@commons.apache.org


Mime
View raw message