commons-dev mailing list archives: April 2012

Site index · List index
Message list1 · 2 · 3 · Next »Thread · Author · Date
Re: [GUMP@vmgump]: Project commons-vfs2-test (in module apache-commons) failed
Ralph Goers   Re: [GUMP@vmgump]: Project commons-vfs2-test (in module apache-commons) failed Sun, 01 Apr, 00:06
Gary Gregory     Re: [GUMP@vmgump]: Project commons-vfs2-test (in module apache-commons) failed Sun, 01 Apr, 14:26
Gump   [GUMP@vmgump]: Project commons-vfs2-test (in module apache-commons) failed Sun, 01 Apr, 06:51
Gump   [GUMP@vmgump]: Project commons-vfs2-test (in module apache-commons) failed Mon, 02 Apr, 06:40
sebb     Re: [GUMP@vmgump]: Project commons-vfs2-test (in module apache-commons) failed Mon, 02 Apr, 10:24
Gump   [GUMP@vmgump]: Project commons-vfs2-test (in module apache-commons) failed Mon, 02 Apr, 18:31
Gump   [GUMP@vmgump]: Project commons-vfs2-test (in module apache-commons) failed Fri, 13 Apr, 06:25
Gump   [GUMP@vmgump]: Project commons-vfs2-test (in module apache-commons) failed Mon, 16 Apr, 05:59
Gump   [GUMP@vmgump]: Project commons-vfs2-test (in module apache-commons) failed Wed, 18 Apr, 06:21
Gump   [GUMP@vmgump]: Project commons-vfs2-test (in module apache-commons) failed Mon, 23 Apr, 06:24
Re: [GUMP@vmgump]: Project commons-configuration-test (in module apache-commons) failed
Ralph Goers   Re: [GUMP@vmgump]: Project commons-configuration-test (in module apache-commons) failed Sun, 01 Apr, 00:11
Stefan Bodewig     Re: [GUMP@vmgump]: Project commons-configuration-test (in module apache-commons) failed Sun, 01 Apr, 05:18
sebb       Re: [GUMP@vmgump]: Project commons-configuration-test (in module apache-commons) failed Sun, 01 Apr, 10:05
Ralph Goers   Re: [GUMP@vmgump]: Project commons-configuration-test (in module apache-commons) failed Sun, 01 Apr, 00:48
Stefan Bodewig     Re: [GUMP@vmgump]: Project commons-configuration-test (in module apache-commons) failed Sun, 01 Apr, 05:23
Ralph Goers       Re: [GUMP@vmgump]: Project commons-configuration-test (in module apache-commons) failed Sun, 01 Apr, 05:38
sebb       Re: [GUMP@vmgump]: Project commons-configuration-test (in module apache-commons) failed Sun, 01 Apr, 10:01
Ralph Goers   Re: [GUMP@vmgump]: Project commons-configuration-test (in module apache-commons) failed Sun, 01 Apr, 06:08
Gump   [GUMP@vmgump]: Project commons-configuration-test (in module apache-commons) failed Sun, 01 Apr, 06:17
Gump   [GUMP@vmgump]: Project commons-configuration-test (in module apache-commons) failed Wed, 11 Apr, 06:44
Gump   [GUMP@vmgump]: Project commons-configuration-test (in module apache-commons) failed Wed, 11 Apr, 18:11
Gump   [GUMP@vmgump]: Project commons-configuration-test (in module apache-commons) failed Thu, 12 Apr, 06:18
Gump   [GUMP@vmgump]: Project commons-configuration-test (in module apache-commons) failed Fri, 13 Apr, 06:18
Gump   [GUMP@vmgump]: Project commons-configuration-test (in module apache-commons) failed Sat, 14 Apr, 06:15
Gump   [GUMP@vmgump]: Project commons-configuration-test (in module apache-commons) failed Sun, 15 Apr, 06:22
Gump   [GUMP@vmgump]: Project commons-configuration-test (in module apache-commons) failed Mon, 16 Apr, 05:51
Gump   [GUMP@vmgump]: Project commons-configuration-test (in module apache-commons) failed Tue, 17 Apr, 06:09
Ralph Goers     Re: [GUMP@vmgump]: Project commons-configuration-test (in module apache-commons) failed Tue, 17 Apr, 06:34
sebb       Re: [GUMP@vmgump]: Project commons-configuration-test (in module apache-commons) failed Tue, 17 Apr, 11:02
Ralph Goers         Re: [GUMP@vmgump]: Project commons-configuration-test (in module apache-commons) failed Tue, 17 Apr, 12:22
sebb           Re: [GUMP@vmgump]: Project commons-configuration-test (in module apache-commons) failed Tue, 17 Apr, 14:31
Re: [io] Moving to Java 6 for version 2.3
Niall Pemberton   Re: [io] Moving to Java 6 for version 2.3 Sun, 01 Apr, 00:43
Tom Everett New projects in the Apache Commons Sun, 01 Apr, 00:53
Luc Maisonobe   Re: New projects in the Apache Commons Sun, 01 Apr, 08:04
Luc Maisonobe     Re: New projects in the Apache Commons Sun, 01 Apr, 13:31
Tom Everett       Re: New projects in the Apache Commons Sun, 01 Apr, 15:09
Ralph Goers         Re: New projects in the Apache Commons Sun, 01 Apr, 15:43
Tom Everett           Re: New projects in the Apache Commons Sun, 01 Apr, 15:58
[GUMP@vmgump]: Project commons-graph (in module commons-sandbox) failed
commons-graph development   [GUMP@vmgump]: Project commons-graph (in module commons-sandbox) failed Sun, 01 Apr, 02:32
commons-graph development   [GUMP@vmgump]: Project commons-graph (in module commons-sandbox) failed Mon, 02 Apr, 03:06
commons-graph development   [GUMP@vmgump]: Project commons-graph (in module commons-sandbox) failed Tue, 03 Apr, 04:04
commons-graph development   [GUMP@vmgump]: Project commons-graph (in module commons-sandbox) failed Wed, 04 Apr, 03:02
commons-graph development   [GUMP@vmgump]: Project commons-graph (in module commons-sandbox) failed Thu, 05 Apr, 02:51
commons-graph development   [GUMP@vmgump]: Project commons-graph (in module commons-sandbox) failed Fri, 06 Apr, 02:46
commons-graph development   [GUMP@vmgump]: Project commons-graph (in module commons-sandbox) failed Sat, 07 Apr, 02:47
commons-graph development   [GUMP@vmgump]: Project commons-graph (in module commons-sandbox) failed Sun, 08 Apr, 03:43
commons-graph development   [GUMP@vmgump]: Project commons-graph (in module commons-sandbox) failed Mon, 09 Apr, 03:00
commons-graph development   [GUMP@vmgump]: Project commons-graph (in module commons-sandbox) failed Tue, 10 Apr, 02:50
commons-graph development   [GUMP@vmgump]: Project commons-graph (in module commons-sandbox) failed Wed, 11 Apr, 03:30
commons-graph development   [GUMP@vmgump]: Project commons-graph (in module commons-sandbox) failed Thu, 12 Apr, 02:50
commons-graph development   [GUMP@vmgump]: Project commons-graph (in module commons-sandbox) failed Fri, 13 Apr, 02:49
commons-graph development   [GUMP@vmgump]: Project commons-graph (in module commons-sandbox) failed Sat, 14 Apr, 02:48
commons-graph development   [GUMP@vmgump]: Project commons-graph (in module commons-sandbox) failed Sun, 15 Apr, 02:53
commons-graph development   [GUMP@vmgump]: Project commons-graph (in module commons-sandbox) failed Mon, 16 Apr, 02:39
commons-graph development   [GUMP@vmgump]: Project commons-graph (in module commons-sandbox) failed Tue, 17 Apr, 02:48
commons-graph development   [GUMP@vmgump]: Project commons-graph (in module commons-sandbox) failed Wed, 18 Apr, 02:53
commons-graph development   [GUMP@vmgump]: Project commons-graph (in module commons-sandbox) failed Thu, 19 Apr, 02:47
commons-graph development   [GUMP@vmgump]: Project commons-graph (in module commons-sandbox) failed Fri, 20 Apr, 02:41
commons-graph development   [GUMP@vmgump]: Project commons-graph (in module commons-sandbox) failed Sat, 21 Apr, 02:40
commons-graph development   [GUMP@vmgump]: Project commons-graph (in module commons-sandbox) failed Sun, 22 Apr, 02:40
commons-graph development   [GUMP@vmgump]: Project commons-graph (in module commons-sandbox) failed Mon, 23 Apr, 02:57
commons-graph development   [GUMP@vmgump]: Project commons-graph (in module commons-sandbox) failed Tue, 24 Apr, 02:40
commons-graph development   [GUMP@vmgump]: Project commons-graph (in module commons-sandbox) failed Wed, 25 Apr, 02:44
commons-graph development   [GUMP@vmgump]: Project commons-graph (in module commons-sandbox) failed Thu, 26 Apr, 02:44
commons-graph development   [GUMP@vmgump]: Project commons-graph (in module commons-sandbox) failed Fri, 27 Apr, 02:47
commons-graph development   [GUMP@vmgump]: Project commons-graph (in module commons-sandbox) failed Sat, 28 Apr, 02:51
commons-graph development   [GUMP@vmgump]: Project commons-graph (in module commons-sandbox) failed Sun, 29 Apr, 02:46
commons-graph development   [GUMP@vmgump]: Project commons-graph (in module commons-sandbox) failed Mon, 30 Apr, 02:49
Gump [GUMP@vmgump]: Project commons-collections4-testframework (in module apache-commons) failed Sun, 01 Apr, 03:14
Re: [compress] Releasing 1.4
Stefan Bodewig   Re: [compress] Releasing 1.4 Sun, 01 Apr, 04:55
sebb     Re: [compress] Releasing 1.4 Sun, 01 Apr, 09:57
Stefan Bodewig   Re: [compress] Releasing 1.4 Sun, 01 Apr, 05:01
Christian Grobmeier     Re: [compress] Releasing 1.4 Sun, 01 Apr, 08:52
Stefan Bodewig       Re: [compress] Releasing 1.4 Mon, 02 Apr, 03:45
Stefan Bodewig   Re: [compress] Releasing 1.4 Sun, 01 Apr, 05:06
[GUMP@vmgump]: Project commons-scxml-test (in module apache-commons) failed
Gump   [GUMP@vmgump]: Project commons-scxml-test (in module apache-commons) failed Sun, 01 Apr, 05:02
Gump   [GUMP@vmgump]: Project commons-scxml-test (in module apache-commons) failed Mon, 02 Apr, 07:13
Gump   [GUMP@vmgump]: Project commons-scxml-test (in module apache-commons) failed Tue, 03 Apr, 08:09
Gump   [GUMP@vmgump]: Project commons-scxml-test (in module apache-commons) failed Wed, 04 Apr, 07:09
Gump   [GUMP@vmgump]: Project commons-scxml-test (in module apache-commons) failed Thu, 05 Apr, 07:07
Gump   [GUMP@vmgump]: Project commons-scxml-test (in module apache-commons) failed Fri, 06 Apr, 06:37
Gump   [GUMP@vmgump]: Project commons-scxml-test (in module apache-commons) failed Sat, 07 Apr, 06:59
Gump   [GUMP@vmgump]: Project commons-scxml-test (in module apache-commons) failed Sun, 08 Apr, 07:47
Gump   [GUMP@vmgump]: Project commons-scxml-test (in module apache-commons) failed Mon, 09 Apr, 07:33
Gump   [GUMP@vmgump]: Project commons-scxml-test (in module apache-commons) failed Tue, 10 Apr, 07:01
Gump   [GUMP@vmgump]: Project commons-scxml-test (in module apache-commons) failed Wed, 11 Apr, 07:23
Gump   [GUMP@vmgump]: Project commons-scxml-test (in module apache-commons) failed Thu, 12 Apr, 07:06
Gump   [GUMP@vmgump]: Project commons-scxml-test (in module apache-commons) failed Fri, 13 Apr, 07:05
Gump   [GUMP@vmgump]: Project commons-scxml-test (in module apache-commons) failed Sat, 14 Apr, 07:01
Gump   [GUMP@vmgump]: Project commons-scxml-test (in module apache-commons) failed Sun, 15 Apr, 07:10
Gump   [GUMP@vmgump]: Project commons-scxml-test (in module apache-commons) failed Mon, 16 Apr, 06:36
Gump   [GUMP@vmgump]: Project commons-scxml-test (in module apache-commons) failed Tue, 17 Apr, 06:56
Gump   [GUMP@vmgump]: Project commons-scxml-test (in module apache-commons) failed Wed, 18 Apr, 07:01
Gump   [GUMP@vmgump]: Project commons-scxml-test (in module apache-commons) failed Thu, 19 Apr, 06:50
Gump   [GUMP@vmgump]: Project commons-scxml-test (in module apache-commons) failed Fri, 20 Apr, 06:29
Gump   [GUMP@vmgump]: Project commons-scxml-test (in module apache-commons) failed Sat, 21 Apr, 06:28
Gump   [GUMP@vmgump]: Project commons-scxml-test (in module apache-commons) failed Sun, 22 Apr, 06:31
Gump   [GUMP@vmgump]: Project commons-scxml-test (in module apache-commons) failed Mon, 23 Apr, 07:02
Gump   [GUMP@vmgump]: Project commons-scxml-test (in module apache-commons) failed Tue, 24 Apr, 06:37
Gump   [GUMP@vmgump]: Project commons-scxml-test (in module apache-commons) failed Wed, 25 Apr, 06:37
Gump   [GUMP@vmgump]: Project commons-scxml-test (in module apache-commons) failed Thu, 26 Apr, 06:35
Gump   [GUMP@vmgump]: Project commons-scxml-test (in module apache-commons) failed Fri, 27 Apr, 06:39
Gump   [GUMP@vmgump]: Project commons-scxml-test (in module apache-commons) failed Sat, 28 Apr, 06:44
Gump   [GUMP@vmgump]: Project commons-scxml-test (in module apache-commons) failed Sun, 29 Apr, 06:31
Gump   [GUMP@vmgump]: Project commons-scxml-test (in module apache-commons) failed Mon, 30 Apr, 07:30
[GUMP@vmgump]: Project commons-proxy-test (in module apache-commons) failed
Gump   [GUMP@vmgump]: Project commons-proxy-test (in module apache-commons) failed Sun, 01 Apr, 06:19
Gump   [GUMP@vmgump]: Project commons-proxy-test (in module apache-commons) failed Mon, 02 Apr, 04:54
sebb     Re: [GUMP@vmgump]: Project commons-proxy-test (in module apache-commons) failed Mon, 02 Apr, 10:21
Gump   [GUMP@vmgump]: Project commons-proxy-test (in module apache-commons) failed Tue, 03 Apr, 05:49
Gump   [GUMP@vmgump]: Project commons-proxy-test (in module apache-commons) failed Wed, 04 Apr, 04:49
Gump   [GUMP@vmgump]: Project commons-proxy-test (in module apache-commons) failed Thu, 05 Apr, 04:41
Gump   [GUMP@vmgump]: Project commons-proxy-test (in module apache-commons) failed Fri, 06 Apr, 04:21
Gump   [GUMP@vmgump]: Project commons-proxy-test (in module apache-commons) failed Sat, 07 Apr, 04:32
Gump   [GUMP@vmgump]: Project commons-proxy-test (in module apache-commons) failed Sun, 08 Apr, 05:25
Gump   [GUMP@vmgump]: Project commons-proxy-test (in module apache-commons) failed Mon, 09 Apr, 05:00
Gump   [GUMP@vmgump]: Project commons-proxy-test (in module apache-commons) failed Tue, 10 Apr, 04:36
Gump   [GUMP@vmgump]: Project commons-proxy-test (in module apache-commons) failed Wed, 11 Apr, 04:59
Gump   [GUMP@vmgump]: Project commons-proxy-test (in module apache-commons) failed Thu, 12 Apr, 04:35
Gump   [GUMP@vmgump]: Project commons-proxy-test (in module apache-commons) failed Fri, 13 Apr, 04:37
Gump   [GUMP@vmgump]: Project commons-proxy-test (in module apache-commons) failed Sat, 14 Apr, 04:32
Gump   [GUMP@vmgump]: Project commons-proxy-test (in module apache-commons) failed Sun, 15 Apr, 04:41
Gump   [GUMP@vmgump]: Project commons-proxy-test (in module apache-commons) failed Mon, 16 Apr, 04:11
Gump   [GUMP@vmgump]: Project commons-proxy-test (in module apache-commons) failed Tue, 17 Apr, 04:25
Gump   [GUMP@vmgump]: Project commons-proxy-test (in module apache-commons) failed Wed, 18 Apr, 04:30
Gump   [GUMP@vmgump]: Project commons-proxy-test (in module apache-commons) failed Thu, 19 Apr, 04:22
Gump   [GUMP@vmgump]: Project commons-proxy-test (in module apache-commons) failed Fri, 20 Apr, 04:07
Gump   [GUMP@vmgump]: Project commons-proxy-test (in module apache-commons) failed Sat, 21 Apr, 04:07
Gump   [GUMP@vmgump]: Project commons-proxy-test (in module apache-commons) failed Sun, 22 Apr, 04:09
Gump   [GUMP@vmgump]: Project commons-proxy-test (in module apache-commons) failed Mon, 23 Apr, 04:35
Gump   [GUMP@vmgump]: Project commons-proxy-test (in module apache-commons) failed Tue, 24 Apr, 04:11
Gump   [GUMP@vmgump]: Project commons-proxy-test (in module apache-commons) failed Wed, 25 Apr, 04:11
Gump   [GUMP@vmgump]: Project commons-proxy-test (in module apache-commons) failed Thu, 26 Apr, 04:12
Gump   [GUMP@vmgump]: Project commons-proxy-test (in module apache-commons) failed Fri, 27 Apr, 04:14
Gump   [GUMP@vmgump]: Project commons-proxy-test (in module apache-commons) failed Sat, 28 Apr, 04:18
Gump   [GUMP@vmgump]: Project commons-proxy-test (in module apache-commons) failed Sun, 29 Apr, 04:11
Gump   [GUMP@vmgump]: Project commons-proxy-test (in module apache-commons) failed Mon, 30 Apr, 04:26
[GUMP@vmgump]: Project commons-id (in module commons-sandbox) failed
Gump   [GUMP@vmgump]: Project commons-id (in module commons-sandbox) failed Sun, 01 Apr, 06:39
Gump   [GUMP@vmgump]: Project commons-id (in module commons-sandbox) failed Mon, 02 Apr, 07:19
Gump   [GUMP@vmgump]: Project commons-id (in module commons-sandbox) failed Tue, 03 Apr, 08:15
Gump   [GUMP@vmgump]: Project commons-id (in module commons-sandbox) failed Wed, 04 Apr, 07:16
Gump   [GUMP@vmgump]: Project commons-id (in module commons-sandbox) failed Thu, 05 Apr, 07:14
Gump   [GUMP@vmgump]: Project commons-id (in module commons-sandbox) failed Fri, 06 Apr, 06:48
Gump   [GUMP@vmgump]: Project commons-id (in module commons-sandbox) failed Sat, 07 Apr, 07:08
Gump   [GUMP@vmgump]: Project commons-id (in module commons-sandbox) failed Sun, 08 Apr, 07:59
Gump   [GUMP@vmgump]: Project commons-id (in module commons-sandbox) failed Mon, 09 Apr, 07:41
Gump   [GUMP@vmgump]: Project commons-id (in module commons-sandbox) failed Tue, 10 Apr, 07:09
Gump   [GUMP@vmgump]: Project commons-id (in module commons-sandbox) failed Wed, 11 Apr, 07:32
Gump   [GUMP@vmgump]: Project commons-id (in module commons-sandbox) failed Thu, 12 Apr, 07:05
Gump   [GUMP@vmgump]: Project commons-id (in module commons-sandbox) failed Fri, 13 Apr, 07:03
Gump   [GUMP@vmgump]: Project commons-id (in module commons-sandbox) failed Sat, 14 Apr, 06:59
Gump   [GUMP@vmgump]: Project commons-id (in module commons-sandbox) failed Sun, 15 Apr, 07:08
Gump   [GUMP@vmgump]: Project commons-id (in module commons-sandbox) failed Mon, 16 Apr, 06:35
Gump   [GUMP@vmgump]: Project commons-id (in module commons-sandbox) failed Tue, 17 Apr, 06:54
Gump   [GUMP@vmgump]: Project commons-id (in module commons-sandbox) failed Wed, 18 Apr, 07:00
Gump   [GUMP@vmgump]: Project commons-id (in module commons-sandbox) failed Thu, 19 Apr, 06:48
Gump   [GUMP@vmgump]: Project commons-id (in module commons-sandbox) failed Fri, 20 Apr, 06:27
Gump   [GUMP@vmgump]: Project commons-id (in module commons-sandbox) failed Sat, 21 Apr, 06:27
Gump   [GUMP@vmgump]: Project commons-id (in module commons-sandbox) failed Sun, 22 Apr, 06:30
Gump   [GUMP@vmgump]: Project commons-id (in module commons-sandbox) failed Mon, 23 Apr, 07:00
Gump   [GUMP@vmgump]: Project commons-id (in module commons-sandbox) failed Tue, 24 Apr, 06:36
Gump   [GUMP@vmgump]: Project commons-id (in module commons-sandbox) failed Wed, 25 Apr, 06:35
Gump   [GUMP@vmgump]: Project commons-id (in module commons-sandbox) failed Thu, 26 Apr, 06:34
Gump   [GUMP@vmgump]: Project commons-id (in module commons-sandbox) failed Fri, 27 Apr, 06:38
Gump   [GUMP@vmgump]: Project commons-id (in module commons-sandbox) failed Sat, 28 Apr, 06:42
Gump   [GUMP@vmgump]: Project commons-id (in module commons-sandbox) failed Sun, 29 Apr, 06:30
Gump   [GUMP@vmgump]: Project commons-id (in module commons-sandbox) failed Mon, 30 Apr, 07:29
Contin...@vmbuild [continuum] BUILD FAILURE: Apache Commons - Commons VFS - Default Maven 2 Build Definition (Java 1.5) Sun, 01 Apr, 17:27
sebb Re: svn commit: r1308156 [1/2] - in /commons/proper/codec/trunk/src: main/java/org/apache/commons/codec/ main/java/org/apache/commons/codec/binary/ main/java/org/apache/commons/codec/digest/ main/java/org/apache/commons/codec/language/ main/java/org/ Sun, 01 Apr, 18:07
Gary Gregory   Re: svn commit: r1308156 [1/2] - in /commons/proper/codec/trunk/src: main/java/org/apache/commons/codec/ main/java/org/apache/commons/codec/binary/ main/java/org/apache/commons/codec/digest/ main/java/org/apache/commons/codec/language/ main/java/org/ Sun, 01 Apr, 18:34
Gary Gregory     Re: svn commit: r1308156 [1/2] - in /commons/proper/codec/trunk/src: main/java/org/apache/commons/codec/ main/java/org/apache/commons/codec/binary/ main/java/org/apache/commons/codec/digest/ main/java/org/apache/commons/codec/language/ main/java/org/ Mon, 02 Apr, 12:11
Re: svn commit: r1308148 - in /commons/proper/configuration/trunk: ./ src/test/java/org/apache/commons/configuration/TestVFSConfigurationBuilder.java
Oliver Heger   Re: svn commit: r1308148 - in /commons/proper/configuration/trunk: ./ src/test/java/org/apache/commons/configuration/TestVFSConfigurationBuilder.java Sun, 01 Apr, 18:26
Elijah Zupancic [chain] Example tests using Mockito Sun, 01 Apr, 21:44
Simone Tripodi   Re: [chain] Example tests using Mockito Wed, 04 Apr, 09:20
[GUMP@vmgump]: Project commons-exec-test (in module apache-commons) failed
Gump   [GUMP@vmgump]: Project commons-exec-test (in module apache-commons) failed Mon, 02 Apr, 14:03
sebb     Re: [GUMP@vmgump]: Project commons-exec-test (in module apache-commons) failed Mon, 02 Apr, 14:07
sebb       Re: [GUMP@vmgump]: Project commons-exec-test (in module apache-commons) failed Mon, 02 Apr, 14:13
sebb         Re: [GUMP@vmgump]: Project commons-exec-test (in module apache-commons) failed Mon, 02 Apr, 14:50
sebb           Re: [GUMP@vmgump]: Project commons-exec-test (in module apache-commons) failed Mon, 02 Apr, 15:43
Gump   [GUMP@vmgump]: Project commons-exec-test (in module apache-commons) failed Tue, 03 Apr, 03:03
Gump   [GUMP@vmgump]: Project commons-exec-test (in module apache-commons) failed Thu, 05 Apr, 14:06
Gump   [GUMP@vmgump]: Project commons-exec-test (in module apache-commons) failed Fri, 06 Apr, 01:58
Gump   [GUMP@vmgump]: Project commons-exec-test (in module apache-commons) failed Sat, 07 Apr, 02:01
Gump   [GUMP@vmgump]: Project commons-exec-test (in module apache-commons) failed Sat, 07 Apr, 13:58
Gump   [GUMP@vmgump]: Project commons-exec-test (in module apache-commons) failed Sun, 08 Apr, 02:58
Gump   [GUMP@vmgump]: Project commons-exec-test (in module apache-commons) failed Mon, 09 Apr, 14:01
Gump   [GUMP@vmgump]: Project commons-exec-test (in module apache-commons) failed Thu, 12 Apr, 02:02
Gump   [GUMP@vmgump]: Project commons-exec-test (in module apache-commons) failed Sun, 15 Apr, 13:59
Gump   [GUMP@vmgump]: Project commons-exec-test (in module apache-commons) failed Sat, 21 Apr, 01:56
Gump   [GUMP@vmgump]: Project commons-exec-test (in module apache-commons) failed Mon, 23 Apr, 01:58
Gump   [GUMP@vmgump]: Project commons-exec-test (in module apache-commons) failed Wed, 25 Apr, 13:59
Gump   [GUMP@vmgump]: Project commons-exec-test (in module apache-commons) failed Thu, 26 Apr, 13:54
Gump   [GUMP@vmgump]: Project commons-exec-test (in module apache-commons) failed Fri, 27 Apr, 13:57
Gump   [GUMP@vmgump]: Project commons-exec-test (in module apache-commons) failed Mon, 30 Apr, 13:58
Gary Gregory [codec] fixing CODEC-96 breaks BC Mon, 02 Apr, 14:09
Gary Gregory   Re: [codec] fixing CODEC-96 breaks BC Mon, 02 Apr, 14:22
sebb   Re: [codec] fixing CODEC-96 breaks BC Mon, 02 Apr, 14:54
Thomas Neidhart   Re: [codec] fixing CODEC-96 breaks BC Mon, 02 Apr, 15:35
Gary Gregory     Re: [codec] fixing CODEC-96 breaks BC Tue, 03 Apr, 19:23
[continuum] BUILD FAILURE: Apache Commons - Commons Exec - Default Maven 2 Build Definition (Java 1.5)
Contin...@vmbuild   [continuum] BUILD FAILURE: Apache Commons - Commons Exec - Default Maven 2 Build Definition (Java 1.5) Mon, 02 Apr, 14:56
Contin...@vmbuild   [continuum] BUILD FAILURE: Apache Commons - Commons Exec - Default Maven 2 Build Definition (Java 1.5) Mon, 02 Apr, 15:10
sebb [ALL] BeanShell incubation? Mon, 02 Apr, 16:30
Gary Gregory   Re: [ALL] BeanShell incubation? Mon, 02 Apr, 16:35
sebb     Re: [ALL] BeanShell incubation? Mon, 02 Apr, 17:56
Christian Grobmeier   Re: [ALL] BeanShell incubation? Mon, 02 Apr, 16:35
David Cogen Commons Collections and Generics Tue, 03 Apr, 16:14
Matt Benson   Re: Commons Collections and Generics Tue, 03 Apr, 17:12
Gary Gregory     Re: Commons Collections and Generics Tue, 03 Apr, 17:22
Re: svn commit: r1309062 - in /commons/proper/codec/trunk/src/main/java/org/apache/commons/codec/binary: BaseNCodecInputStream.java BaseNCodecOutputStream.java
sebb   Re: svn commit: r1309062 - in /commons/proper/codec/trunk/src/main/java/org/apache/commons/codec/binary: BaseNCodecInputStream.java BaseNCodecOutputStream.java Tue, 03 Apr, 18:27
Gary Gregory [io] Release 2.3 to pick up all new Charset APIs Wed, 04 Apr, 15:28
sebb   Re: [io] Release 2.3 to pick up all new Charset APIs Wed, 04 Apr, 23:07
Gary Gregory     Re: [io] Release 2.3 to pick up all new Charset APIs Wed, 04 Apr, 23:20
Gary Gregory     Re: [io] Release 2.3 to pick up all new Charset APIs Thu, 05 Apr, 18:34
Stefan Bodewig [VOTE] Release Compress 1.4 based on RC1 Wed, 04 Apr, 20:00
sebb   Re: [VOTE] Release Compress 1.4 based on RC1 Wed, 04 Apr, 23:22
Stefan Bodewig     Re: [VOTE] Release Compress 1.4 based on RC1 Thu, 05 Apr, 03:50
Gary Gregory   Re: [VOTE] Release Compress 1.4 based on RC1 Thu, 05 Apr, 04:06
Oliver Heger   Re: [VOTE] Release Compress 1.4 based on RC1 Thu, 05 Apr, 19:29
Torsten Curdt     Re: [VOTE] Release Compress 1.4 based on RC1 Thu, 05 Apr, 19:33
Emmanuel Bourg   Re: [VOTE] Release Compress 1.4 based on RC1 Thu, 05 Apr, 20:27
Gary Gregory     Re: [VOTE] Release Compress 1.4 based on RC1 Thu, 05 Apr, 22:00
Stefan Bodewig     Re: [VOTE] Release Compress 1.4 based on RC1 Fri, 06 Apr, 05:12
Stefan Bodewig     Re: [VOTE] Release Compress 1.4 based on RC1 Sun, 08 Apr, 04:00
Jörg Schaible   Re: [VOTE] Release Compress 1.4 based on RC1 Sat, 07 Apr, 12:42
Stefan Bodewig   Re: [VOTE] Release Compress 1.4 based on RC1 Wed, 11 Apr, 04:16
Stefan Bodewig   [RESULT] Passed: Release Compress 1.4 based on RC1 Wed, 11 Apr, 04:18
Gary Gregory [lang] SerializationUtils and generics Thu, 05 Apr, 15:24
Jörg Schaible   Re: [lang] SerializationUtils and generics Thu, 05 Apr, 15:38
sebb     Re: [lang] SerializationUtils and generics Fri, 06 Apr, 16:44
Gary Gregory       Re: [lang] SerializationUtils and generics Fri, 06 Apr, 20:58
[continuum] BUILD FAILURE: Apache Commons - Apache Commons Digester - Build using Java 1.6
Contin...@vmbuild   [continuum] BUILD FAILURE: Apache Commons - Apache Commons Digester - Build using Java 1.6 Thu, 05 Apr, 17:21
Contin...@vmbuild   [continuum] BUILD FAILURE: Apache Commons - Apache Commons Digester - Build using Java 1.6 Thu, 05 Apr, 21:21
Contin...@vmbuild   [continuum] BUILD FAILURE: Apache Commons - Apache Commons Digester - Build using Java 1.6 Thu, 05 Apr, 23:21
Contin...@vmbuild   [continuum] BUILD FAILURE: Apache Commons - Apache Commons Digester - Build using Java 1.6 Fri, 06 Apr, 09:21
Contin...@vmbuild   [continuum] BUILD FAILURE: Apache Commons - Apache Commons Digester - Build using Java 1.6 Fri, 06 Apr, 10:21
Contin...@vmbuild   [continuum] BUILD FAILURE: Apache Commons - Apache Commons Digester - Build using Java 1.6 Thu, 19 Apr, 21:21
[GUMP@vmgump]: Project commons-digester3 (in module apache-commons) failed
Gump   [GUMP@vmgump]: Project commons-digester3 (in module apache-commons) failed Fri, 06 Apr, 01:50
Gump   [GUMP@vmgump]: Project commons-digester3 (in module apache-commons) failed Fri, 06 Apr, 14:38
Gump   [GUMP@vmgump]: Project commons-digester3 (in module apache-commons) failed Sat, 07 Apr, 02:40
Gump   [GUMP@vmgump]: Project commons-digester3 (in module apache-commons) failed Sun, 08 Apr, 03:36
Gump   [GUMP@vmgump]: Project commons-digester3 (in module apache-commons) failed Mon, 09 Apr, 02:53
Gump   [GUMP@vmgump]: Project commons-digester3 (in module apache-commons) failed Tue, 10 Apr, 02:42
Gump   [GUMP@vmgump]: Project commons-digester3 (in module apache-commons) failed Wed, 11 Apr, 03:23
Gump   [GUMP@vmgump]: Project commons-digester3 (in module apache-commons) failed Thu, 12 Apr, 02:43
Gump   [GUMP@vmgump]: Project commons-digester3 (in module apache-commons) failed Fri, 13 Apr, 02:42
Gump   [GUMP@vmgump]: Project commons-digester3 (in module apache-commons) failed Sat, 14 Apr, 02:41
Gump   [GUMP@vmgump]: Project commons-digester3 (in module apache-commons) failed Sun, 15 Apr, 02:46
Gump   [GUMP@vmgump]: Project commons-digester3 (in module apache-commons) failed Mon, 16 Apr, 02:35
Gump   [GUMP@vmgump]: Project commons-digester3 (in module apache-commons) failed Tue, 17 Apr, 02:44
Gump   [GUMP@vmgump]: Project commons-digester3 (in module apache-commons) failed Wed, 18 Apr, 02:48
Gump   [GUMP@vmgump]: Project commons-digester3 (in module apache-commons) failed Thu, 19 Apr, 02:42
Gump   [GUMP@vmgump]: Project commons-digester3 (in module apache-commons) failed Fri, 20 Apr, 02:37
Gump   [GUMP@vmgump]: Project commons-digester3 (in module apache-commons) failed Sat, 21 Apr, 02:36
Gump   [GUMP@vmgump]: Project commons-digester3 (in module apache-commons) failed Sun, 22 Apr, 02:35
Gump   [GUMP@vmgump]: Project commons-digester3 (in module apache-commons) failed Mon, 23 Apr, 02:52
Gump   [GUMP@vmgump]: Project commons-digester3 (in module apache-commons) failed Tue, 24 Apr, 02:36
Gump   [GUMP@vmgump]: Project commons-digester3 (in module apache-commons) failed Wed, 25 Apr, 02:40
Gump   [GUMP@vmgump]: Project commons-digester3 (in module apache-commons) failed Thu, 26 Apr, 02:40
Gump   [GUMP@vmgump]: Project commons-digester3 (in module apache-commons) failed Fri, 27 Apr, 02:43
Gump   [GUMP@vmgump]: Project commons-digester3 (in module apache-commons) failed Sat, 28 Apr, 02:47
Gump   [GUMP@vmgump]: Project commons-digester3 (in module apache-commons) failed Sun, 29 Apr, 02:41
Gump   [GUMP@vmgump]: Project commons-digester3 (in module apache-commons) failed Mon, 30 Apr, 02:44
luc [lang] adding an implementation of the Myers difference algorithm Fri, 06 Apr, 15:14
Gary Gregory   Re: [lang] adding an implementation of the Myers difference algorithm Fri, 06 Apr, 19:50
Luc Maisonobe     Re: [lang] adding an implementation of the Myers difference algorithm Fri, 06 Apr, 20:02
Gary Gregory     Re: [lang] adding an implementation of the Myers difference algorithm Sat, 07 Apr, 02:30
Luc Maisonobe       [codec][collections][math]Re: [lang] adding an implementation of the Myers difference algorithm Sat, 07 Apr, 09:41
James Carman         Re: [codec][collections][math]Re: [lang] adding an implementation of the Myers difference algorithm Sat, 07 Apr, 15:16
Gary Gregory       Re: [codec][collections][math]Re: [lang] adding an implementation of the Myers difference algorithm Sat, 07 Apr, 10:37
Oliver Heger         Re: [codec][collections][math]Re: [lang] adding an implementation of the Myers difference algorithm Sat, 07 Apr, 14:26
Re: svn commit: r1309910 - in /commons/proper/lang/trunk/src/test/java/org/apache/commons/lang3: ArrayUtilsRemoveMultipleTest.java BooleanUtilsTest.java EnumUtilsTest.java ObjectUtilsTest.java RangeTest.java
sebb   Re: svn commit: r1309910 - in /commons/proper/lang/trunk/src/test/java/org/apache/commons/lang3: ArrayUtilsRemoveMultipleTest.java BooleanUtilsTest.java EnumUtilsTest.java ObjectUtilsTest.java RangeTest.java Fri, 06 Apr, 16:25
Re: svn commit: r1309920 - in /commons/proper/lang/trunk/src: main/java/org/apache/commons/lang3/ site/changes/ test/java/org/apache/commons/lang3/exception/ test/java/org/apache/commons/lang3/time/
sebb   Re: svn commit: r1309920 - in /commons/proper/lang/trunk/src: main/java/org/apache/commons/lang3/ site/changes/ test/java/org/apache/commons/lang3/exception/ test/java/org/apache/commons/lang3/time/ Fri, 06 Apr, 16:31
Bruno P. Kinoshita [functor] Distribute tests from TestAlgorithms into several test classes under algorithm test package Mon, 09 Apr, 04:57
Matt Benson   Re: [functor] Distribute tests from TestAlgorithms into several test classes under algorithm test package Mon, 09 Apr, 05:43
Bruno P. Kinoshita     Re: [functor] Distribute tests from TestAlgorithms into several test classes under algorithm test package Mon, 09 Apr, 06:12
Bruno P. Kinoshita [functor] Keep Serializable in [functor] or drop it? Mon, 09 Apr, 16:55
Honton, Charles [classscan],[meiyo],[sandbox] Sharing a concrete proposal for class path scanning / class metadata Mon, 09 Apr, 21:29
James Carman   Re: [classscan],[meiyo],[sandbox] Sharing a concrete proposal for class path scanning / class metadata Mon, 09 Apr, 22:20
Simone Tripodi     Re: [classscan],[meiyo],[sandbox] Sharing a concrete proposal for class path scanning / class metadata Wed, 11 Apr, 07:16
Honton, Charles       RE: [classscan],[meiyo],[sandbox] Sharing a concrete proposal for class path scanning / class metadata Wed, 11 Apr, 16:13
James Carman         Re: [classscan],[meiyo],[sandbox] Sharing a concrete proposal for class path scanning / class metadata Wed, 11 Apr, 16:35
Matt Benson           Re: [classscan],[meiyo],[sandbox] Sharing a concrete proposal for class path scanning / class metadata Wed, 11 Apr, 17:57
Mark Struberg             Re: [classscan],[meiyo],[sandbox] Sharing a concrete proposal for class path scanning / class metadata Wed, 11 Apr, 18:46
Honton, Charles               RE: [classscan],[meiyo],[sandbox] Sharing a concrete proposal for class path scanning / class metadata Wed, 11 Apr, 20:47
Ralph Goers                 Re: [classscan],[meiyo],[sandbox] Sharing a concrete proposal for class path scanning / class metadata Wed, 11 Apr, 23:47
Honton, Charles                 Re: [classscan],[meiyo],[sandbox] Sharing a concrete proposal for class path scanning / class metadata Thu, 12 Apr, 21:16
Matt Benson                   Re: [classscan],[meiyo],[sandbox] Sharing a concrete proposal for class path scanning / class metadata Thu, 12 Apr, 21:39
Matt Benson                     Re: [classscan],[meiyo],[sandbox] Sharing a concrete proposal for class path scanning / class metadata Fri, 13 Apr, 22:19
Simone Tripodi           Re: [classscan],[meiyo],[sandbox] Sharing a concrete proposal for class path scanning / class metadata Wed, 11 Apr, 19:21
Honton, Charles   Re: [classscan],[meiyo],[sandbox] Sharing a concrete proposal for class path scanning / class metadata Mon, 16 Apr, 18:51
Honton, Charles [bcel] Issue 52979 Mon, 09 Apr, 21:36
Torsten Curdt   Re: [bcel] Issue 52979 Tue, 10 Apr, 21:39
Contin...@vmbuild [continuum] BUILD FAILURE: Apache Commons - Commons IO - Build using Java 1.6 Mon, 09 Apr, 22:22
Claudio Squarcella [net] parser for MRT (routing information export) file format Tue, 10 Apr, 14:06
Gary Gregory   Re: [net] parser for MRT (routing information export) file format Tue, 10 Apr, 14:46
Gary Gregory [VOTE] Release Commons IO 2.3-RC1 Tue, 10 Apr, 15:54
Gary Gregory   Re: [VOTE] Release Commons IO 2.3-RC1 Wed, 11 Apr, 13:08
Brent Worden   Re: [VOTE] Release Commons IO 2.3-RC1 Wed, 11 Apr, 13:44
Oliver Heger   Re: [VOTE] Release Commons IO 2.3-RC1 Wed, 11 Apr, 17:32
Gary Gregory     Re: [VOTE] Release Commons IO 2.3-RC1 Wed, 11 Apr, 17:45
Jörg Schaible   Re: [VOTE] Release Commons IO 2.3-RC1 Fri, 13 Apr, 21:17
Gary Gregory     [VOTE][RESULT] Release Commons IO 2.3-RC1 Sat, 14 Apr, 00:49
Matt Benson Re: svn commit: r1311904 [1/2] - in /commons/proper/collections/trunk: ./ src/main/java/org/apache/commons/collections/ src/main/java/org/apache/commons/collections/functors/ src/main/java/org/apache/commons/collections/list/difference/ src/test/java Tue, 10 Apr, 18:28
Luc Maisonobe   Re: svn commit: r1311904 [1/2] - in /commons/proper/collections/trunk: ./ src/main/java/org/apache/commons/collections/ src/main/java/org/apache/commons/collections/functors/ src/main/java/org/apache/commons/collections/list/difference/ src/test/java Tue, 10 Apr, 18:39
Konstantin Kolinko   Re: svn commit: r1311904 [1/2] - in /commons/proper/collections/trunk: ./ src/main/java/org/apache/commons/collections/ src/main/java/org/apache/commons/collections/functors/ src/main/java/org/apache/commons/collections/list/difference/ src/test/java Tue, 10 Apr, 19:00
Luc Maisonobe     Re: svn commit: r1311904 [1/2] - in /commons/proper/collections/trunk: ./ src/main/java/org/apache/commons/collections/ src/main/java/org/apache/commons/collections/functors/ src/main/java/org/apache/commons/collections/list/difference/ src/test/java Tue, 10 Apr, 19:23
Re: svn commit: r1311993 - in /commons/proper/pool/trunk/src/java/org/apache/commons/pool2/impl: InterruptibleReentrantLock.java LinkedBlockingDeque.java
Mark Thomas   Re: svn commit: r1311993 - in /commons/proper/pool/trunk/src/java/org/apache/commons/pool2/impl: InterruptibleReentrantLock.java LinkedBlockingDeque.java Tue, 10 Apr, 21:18
[continuum] BUILD FAILURE: Apache Commons - Commons Pool - Build using Java 1.6
Contin...@vmbuild   [continuum] BUILD FAILURE: Apache Commons - Commons Pool - Build using Java 1.6 Tue, 10 Apr, 21:24
Contin...@vmbuild   [continuum] BUILD FAILURE: Apache Commons - Commons Pool - Build using Java 1.6 Wed, 11 Apr, 19:24
Contin...@vmbuild   [continuum] BUILD FAILURE: Apache Commons - Commons Pool - Build using Java 1.6 Wed, 11 Apr, 21:24
Contin...@vmbuild   [continuum] BUILD FAILURE: Apache Commons - Commons Pool - Build using Java 1.6 Thu, 12 Apr, 19:24
Contin...@vmbuild   [continuum] BUILD FAILURE: Apache Commons - Commons Pool - Build using Java 1.6 Thu, 12 Apr, 20:24
Contin...@vmbuild   [continuum] BUILD FAILURE: Apache Commons - Commons Pool - Build using Java 1.6 Thu, 12 Apr, 21:24
Contin...@vmbuild   [continuum] BUILD FAILURE: Apache Commons - Commons Pool - Build using Java 1.6 Fri, 13 Apr, 18:24
Contin...@vmbuild   [continuum] BUILD FAILURE: Apache Commons - Commons Pool - Build using Java 1.6 Fri, 13 Apr, 19:24
Contin...@vmbuild   [continuum] BUILD FAILURE: Apache Commons - Commons Pool - Build using Java 1.6 Fri, 13 Apr, 23:24
Contin...@vmbuild   [continuum] BUILD FAILURE: Apache Commons - Commons Pool - Build using Java 1.6 Sat, 14 Apr, 00:24
Sébastien Brisard [math] Is overflow dealt with properly in Dfp? Wed, 11 Apr, 04:23
luc   Re: [math] Is overflow dealt with properly in Dfp? Wed, 11 Apr, 08:16
Sébastien Brisard     Re: [math] Is overflow dealt with properly in Dfp? Fri, 13 Apr, 15:30
Gilles Sadowski [Math] Broken links in "userguide" Wed, 11 Apr, 10:03
sebb   Re: [Math] Broken links in "userguide" Wed, 11 Apr, 13:47
Message list1 · 2 · 3 · Next »Thread · Author · Date
Box list
Oct 2014388
Sep 2014283
Aug 2014191
Jul 2014349
Jun 2014310
May 2014468
Apr 2014428
Mar 2014311
Feb 2014535
Jan 2014561
Dec 2013321
Nov 2013542
Oct 20131116
Sep 2013203
Aug 2013639
Jul 2013472
Jun 2013364
May 2013381
Apr 2013381
Mar 2013944
Feb 2013421
Jan 2013654
Dec 2012720
Nov 2012609
Oct 2012461
Sep 2012706
Aug 2012783
Jul 2012665
Jun 2012670
May 2012479
Apr 2012491
Mar 20121283
Feb 2012810
Jan 2012602
Dec 2011885
Nov 2011685
Oct 2011789
Sep 2011928
Aug 20111048
Jul 2011823
Jun 2011590
May 2011661
Apr 2011764
Mar 2011788
Feb 2011506
Jan 2011707
Dec 2010362
Nov 2010734
Oct 2010694
Sep 2010557
Aug 2010611
Jul 2010438
Jun 2010264
May 2010209
Apr 2010371
Mar 2010663
Feb 2010326
Jan 2010376
Dec 2009308
Nov 2009486
Oct 2009339
Sep 2009286
Aug 2009467
Jul 2009411
Jun 2009420
May 2009804
Apr 2009501
Mar 2009659
Feb 2009419
Jan 2009461
Dec 2008295
Nov 2008294
Oct 2008247
Sep 2008171
Aug 2008198
Jul 2008218
Jun 2008377
May 2008676
Apr 20081093
Mar 2008741
Feb 2008653
Jan 2008880
Dec 2007268
Nov 2007374
Oct 2007280
Sep 2007261
Aug 2007451
Jul 20071189
Jun 2007970
May 2007982
Apr 2007715
Mar 2007720
Feb 2007876
Jan 20071026
Dec 20061008
Nov 20061579
Oct 2006890
Sep 2006643
Aug 2006995
Jul 20061542
Jun 2006750
May 20061059
Apr 20061280
Mar 20061782
Feb 20061147
Jan 20061351
Dec 20051531
Nov 20051520
Oct 20051020
Sep 20051068
Aug 20051757
Jul 20051166
Jun 20051478
May 20051309
Apr 2005925
Mar 20051063
Feb 20051528
Jan 20051715
Dec 20041414
Nov 20041732
Oct 20041649
Sep 20042039
Aug 20041449
Jul 20041239
Jun 20041923
May 20041967
Apr 20041481
Mar 20042020
Feb 20041944
Jan 20041969
Dec 20031510
Nov 20032060
Oct 20032096
Sep 20032048
Aug 20031901
Jul 20031556
Jun 20031833
May 20031441
Apr 20031378
Mar 20031394
Feb 20031441
Jan 20032603
Dec 20021234
Nov 20021437
Oct 20022149
Sep 20021572
Aug 20022411
Jul 20022394
Jun 20021965
May 20021124
Apr 20021334
Mar 2002991
Feb 20021720
Jan 20021856
Dec 2001512
Nov 2001266
Oct 200119