commons-dev mailing list archives

Site index · List index
Message view « Date » · « Thread »
Top « Date » · « Thread »
From Gump <iss...@commons.apache.org>
Subject [GUMP@vmgump]: Project commons-id (in module commons-sandbox) failed
Date Fri, 13 Apr 2012 07:03:37 GMT
To whom it may engage...
        
This is an automated request, but not an unsolicited one. For 
more information please visit http://gump.apache.org/nagged.html, 
and/or contact the folk at general@gump.apache.org.

Project commons-id has an issue affecting its community integration.
This issue affects 1 projects,
 and has been outstanding for 64 runs.
The current state of this project is 'Failed', with reason 'Missing Build Outputs'.
For reference only, the following projects are affected by this:
    - commons-id :  Commons Identifier Package


Full details are available at:
    http://vmgump.apache.org/gump/public/commons-sandbox/commons-id/index.html

That said, some information snippets are provided here.

The following annotations (debug/informational/warning/error messages) were provided:
 -DEBUG- Sole jar output [commons-id-13042012.jar] identifier set to project name
 -DEBUG- (Apache Gump generated) Apache Maven Settings in: /srv/gump/public/workspace/commons-sandbox/id/gump_mvn_settings.xml
 -DEBUG- Maven POM in: /srv/gump/public/workspace/commons-sandbox/id/pom.xml
 -INFO- Failed with reason missing build outputs
 -ERROR- Missing Output: /srv/gump/public/workspace/commons-sandbox/id/target/commons-id-13042012.jar
 -ERROR- See Directory Listing Work for Missing Outputs
 -INFO- Project Reports in: /srv/gump/public/workspace/commons-sandbox/id/target/surefire-reports
 -INFO- Failed to extract fallback artifacts from Gump Repository



The following work was performed:
http://vmgump.apache.org/gump/public/commons-sandbox/commons-id/gump_work/build_commons-sandbox_commons-id.html
Work Name: build_commons-sandbox_commons-id (Type: Build)
Work ended in a state of : Success
Elapsed: 41 secs
Command Line: /opt/maven2/bin/mvn --batch-mode -Dmaven.final.name=commons-id-13042012 --settings
/srv/gump/public/workspace/commons-sandbox/id/gump_mvn_settings.xml package 
[Working Directory: /srv/gump/public/workspace/commons-sandbox/id]
M2_HOME: /opt/maven2
---------------------------------------------
Tests run: 2, Failures: 0, Errors: 0, Skipped: 0, Time elapsed: 0.007 sec
Running org.apache.commons.id.serial.AlphanumericGeneratorTest
Tests run: 9, Failures: 0, Errors: 0, Skipped: 0, Time elapsed: 0.027 sec
Running org.apache.commons.id.uuid.state.ReadOnlyResourceStateImplTest
Tests run: 5, Failures: 0, Errors: 0, Skipped: 0, Time elapsed: 0.031 sec
Running org.apache.commons.id.uuid.state.InMemoryStateImplTest
Tests run: 5, Failures: 1, Errors: 0, Skipped: 0, Time elapsed: 0.026 sec <<< FAILURE!
Running org.apache.commons.id.serial.LongGeneratorTest
Tests run: 8, Failures: 0, Errors: 0, Skipped: 0, Time elapsed: 0.017 sec
Running org.apache.commons.id.random.SessionIdGeneratorTest
Tests run: 5, Failures: 0, Errors: 0, Skipped: 0, Time elapsed: 0.85 sec
Running org.apache.commons.id.serial.TimeBasedAlphanumericIdentifierGeneratorTest
Tests run: 12, Failures: 0, Errors: 0, Skipped: 0, Time elapsed: 0.468 sec
Running org.apache.commons.id.serial.PrefixedNumericGeneratorTest
Tests run: 4, Failures: 0, Errors: 0, Skipped: 0, Time elapsed: 0.02 sec
Running org.apache.commons.id.uuid.VersionFourGeneratorTest
Tests run: 2, Failures: 0, Errors: 0, Skipped: 0, Time elapsed: 22.542 sec
Running org.apache.commons.id.uuid.state.NodeTest
Tests run: 8, Failures: 0, Errors: 3, Skipped: 0, Time elapsed: 0.021 sec <<< FAILURE!
Running org.apache.commons.id.uuid.state.ReadWriteFileStateImplTest
Tests run: 1, Failures: 0, Errors: 0, Skipped: 0, Time elapsed: 0.01 sec
Running org.apache.commons.id.uuid.task.UUIDTaskTest
Tests run: 5, Failures: 0, Errors: 0, Skipped: 0, Time elapsed: 0.044 sec
Running org.apache.commons.id.serial.NumericGeneratorTest
Tests run: 8, Failures: 0, Errors: 0, Skipped: 0, Time elapsed: 0.008 sec

Results :

Failed tests: 
  testLoad(org.apache.commons.id.uuid.state.InMemoryStateImplTest)

Tests in error: 
  testGetUUIDTime(org.apache.commons.id.uuid.state.NodeTest)
  testGetLastTimestamp(org.apache.commons.id.uuid.state.NodeTest)
  testNodebyteArray(org.apache.commons.id.uuid.state.NodeTest)

Tests run: 121, Failures: 1, Errors: 3, Skipped: 0

[ERROR] There are test failures.

Please refer to /srv/gump/public/workspace/commons-sandbox/id/target/surefire-reports for
the individual test results.
[INFO] [jar:jar {execution: default-jar}]
[INFO] Building jar: /srv/gump/public/workspace/commons-sandbox/id/target/commons-id-1.0-SNAPSHOT.jar
[INFO] ------------------------------------------------------------------------
[INFO] BUILD SUCCESSFUL
[INFO] ------------------------------------------------------------------------
[INFO] Total time: 40 seconds
[INFO] Finished at: Fri Apr 13 07:03:35 UTC 2012
[INFO] Final Memory: 30M/71M
[INFO] ------------------------------------------------------------------------
---------------------------------------------

To subscribe to this information via syndicated feeds:
- RSS: http://vmgump.apache.org/gump/public/commons-sandbox/commons-id/rss.xml
- Atom: http://vmgump.apache.org/gump/public/commons-sandbox/commons-id/atom.xml

============================== Gump Tracking Only ===
Produced by Apache Gump(TM) version 2.3.
Gump Run 12000013042012, vmgump.apache.org:vmgump:12000013042012
Gump E-mail Identifier (unique within run) #49.

--
Apache Gump
http://gump.apache.org/ [Instance: vmgump]

---------------------------------------------------------------------
To unsubscribe, e-mail: dev-unsubscribe@commons.apache.org
For additional commands, e-mail: dev-help@commons.apache.org


Mime
View raw message