commons-dev mailing list archives: March 2012

Site index · List index
Message list1 · 2 · 3 · 4 · 5 · 6 · Next »Thread · Author · Date
[GUMP@vmgump]: Project commons-digester3 (in module apache-commons) failed
Gump   [GUMP@vmgump]: Project commons-digester3 (in module apache-commons) failed Thu, 01 Mar, 02:40
Gump   [GUMP@vmgump]: Project commons-digester3 (in module apache-commons) failed Fri, 02 Mar, 02:44
Gump   [GUMP@vmgump]: Project commons-digester3 (in module apache-commons) failed Sat, 03 Mar, 02:35
Gump   [GUMP@vmgump]: Project commons-digester3 (in module apache-commons) failed Sun, 04 Mar, 02:35
Gump   [GUMP@vmgump]: Project commons-digester3 (in module apache-commons) failed Mon, 05 Mar, 02:38
Gump   [GUMP@vmgump]: Project commons-digester3 (in module apache-commons) failed Tue, 06 Mar, 02:41
Gump   [GUMP@vmgump]: Project commons-digester3 (in module apache-commons) failed Wed, 07 Mar, 02:38
Gump   [GUMP@vmgump]: Project commons-digester3 (in module apache-commons) failed Thu, 08 Mar, 02:37
Gump   [GUMP@vmgump]: Project commons-digester3 (in module apache-commons) failed Fri, 09 Mar, 02:36
Gump   [GUMP@vmgump]: Project commons-digester3 (in module apache-commons) failed Sat, 10 Mar, 02:40
Gump   [GUMP@vmgump]: Project commons-digester3 (in module apache-commons) failed Sun, 11 Mar, 02:30
Gump   [GUMP@vmgump]: Project commons-digester3 (in module apache-commons) failed Mon, 12 Mar, 02:34
Gump   [GUMP@vmgump]: Project commons-digester3 (in module apache-commons) failed Tue, 13 Mar, 02:34
Gump   [GUMP@vmgump]: Project commons-digester3 (in module apache-commons) failed Wed, 14 Mar, 02:35
Gump   [GUMP@vmgump]: Project commons-digester3 (in module apache-commons) failed Thu, 15 Mar, 02:45
Gump   [GUMP@vmgump]: Project commons-digester3 (in module apache-commons) failed Fri, 16 Mar, 02:39
Gump   [GUMP@vmgump]: Project commons-digester3 (in module apache-commons) failed Sat, 17 Mar, 02:39
Gump   [GUMP@vmgump]: Project commons-digester3 (in module apache-commons) failed Sun, 18 Mar, 02:37
Gump   [GUMP@vmgump]: Project commons-digester3 (in module apache-commons) failed Mon, 19 Mar, 02:35
Gump   [GUMP@vmgump]: Project commons-digester3 (in module apache-commons) failed Tue, 20 Mar, 02:40
Gump   [GUMP@vmgump]: Project commons-digester3 (in module apache-commons) failed Wed, 21 Mar, 02:34
Gump   [GUMP@vmgump]: Project commons-digester3 (in module apache-commons) failed Thu, 22 Mar, 03:34
Gump   [GUMP@vmgump]: Project commons-digester3 (in module apache-commons) failed Fri, 23 Mar, 02:45
Gump   [GUMP@vmgump]: Project commons-digester3 (in module apache-commons) failed Sat, 24 Mar, 02:37
Gump   [GUMP@vmgump]: Project commons-digester3 (in module apache-commons) failed Sun, 25 Mar, 02:41
Gump   [GUMP@vmgump]: Project commons-digester3 (in module apache-commons) failed Mon, 26 Mar, 02:42
Re: [Math] Still problems with maven and gpg
sebb   Re: [Math] Still problems with maven and gpg Thu, 01 Mar, 02:46
Gilles Sadowski     Re: [Math] Still problems with maven and gpg Thu, 01 Mar, 14:01
sebb       Re: [Math] Still problems with maven and gpg Thu, 01 Mar, 15:09
Gilles Sadowski         Re: [Math] Still problems with maven and gpg Thu, 01 Mar, 15:55
[GUMP@vmgump]: Project commons-exec-test (in module apache-commons) failed
Gump   [GUMP@vmgump]: Project commons-exec-test (in module apache-commons) failed Thu, 01 Mar, 02:48
Gump   [GUMP@vmgump]: Project commons-exec-test (in module apache-commons) failed Fri, 02 Mar, 02:52
Gump   [GUMP@vmgump]: Project commons-exec-test (in module apache-commons) failed Sat, 03 Mar, 02:43
Gump   [GUMP@vmgump]: Project commons-exec-test (in module apache-commons) failed Sun, 04 Mar, 02:43
Gump   [GUMP@vmgump]: Project commons-exec-test (in module apache-commons) failed Mon, 05 Mar, 02:47
Gump   [GUMP@vmgump]: Project commons-exec-test (in module apache-commons) failed Tue, 06 Mar, 02:49
Gump   [GUMP@vmgump]: Project commons-exec-test (in module apache-commons) failed Tue, 06 Mar, 14:39
Gump   [GUMP@vmgump]: Project commons-exec-test (in module apache-commons) failed Fri, 09 Mar, 02:44
Gump   [GUMP@vmgump]: Project commons-exec-test (in module apache-commons) failed Sat, 10 Mar, 14:43
Gump   [GUMP@vmgump]: Project commons-exec-test (in module apache-commons) failed Sun, 11 Mar, 02:38
Gump   [GUMP@vmgump]: Project commons-exec-test (in module apache-commons) failed Wed, 14 Mar, 02:43
Gump   [GUMP@vmgump]: Project commons-exec-test (in module apache-commons) failed Thu, 15 Mar, 14:42
Gump   [GUMP@vmgump]: Project commons-exec-test (in module apache-commons) failed Fri, 16 Mar, 14:41
Gump   [GUMP@vmgump]: Project commons-exec-test (in module apache-commons) failed Sat, 17 Mar, 02:47
Gump   [GUMP@vmgump]: Project commons-exec-test (in module apache-commons) failed Sun, 18 Mar, 02:45
Gump   [GUMP@vmgump]: Project commons-exec-test (in module apache-commons) failed Mon, 19 Mar, 02:43
Gump   [GUMP@vmgump]: Project commons-exec-test (in module apache-commons) failed Mon, 19 Mar, 14:42
Gump   [GUMP@vmgump]: Project commons-exec-test (in module apache-commons) failed Tue, 20 Mar, 02:49
Gump   [GUMP@vmgump]: Project commons-exec-test (in module apache-commons) failed Fri, 23 Mar, 02:53
Gump   [GUMP@vmgump]: Project commons-exec-test (in module apache-commons) failed Sat, 24 Mar, 02:45
Gump   [GUMP@vmgump]: Project commons-exec-test (in module apache-commons) failed Sat, 24 Mar, 14:45
Gump   [GUMP@vmgump]: Project commons-exec-test (in module apache-commons) failed Sun, 25 Mar, 02:49
Gump   [GUMP@vmgump]: Project commons-exec-test (in module apache-commons) failed Mon, 26 Mar, 14:47
Gump   [GUMP@vmgump]: Project commons-exec-test (in module apache-commons) failed Tue, 27 Mar, 14:51
Gump   [GUMP@vmgump]: Project commons-exec-test (in module apache-commons) failed Wed, 28 Mar, 02:53
Gump   [GUMP@vmgump]: Project commons-exec-test (in module apache-commons) failed Thu, 29 Mar, 15:04
Gump   [GUMP@vmgump]: Project commons-exec-test (in module apache-commons) failed Fri, 30 Mar, 14:52
[GUMP@vmgump]: Project commons-lang3-test (in module apache-commons) failed
Gump   [GUMP@vmgump]: Project commons-lang3-test (in module apache-commons) failed Thu, 01 Mar, 03:34
Gump   [GUMP@vmgump]: Project commons-lang3-test (in module apache-commons) failed Fri, 02 Mar, 03:39
Gump   [GUMP@vmgump]: Project commons-lang3-test (in module apache-commons) failed Sat, 03 Mar, 03:29
Gump   [GUMP@vmgump]: Project commons-lang3-test (in module apache-commons) failed Sun, 04 Mar, 03:26
Gump   [GUMP@vmgump]: Project commons-lang3-test (in module apache-commons) failed Mon, 05 Mar, 03:31
Gump   [GUMP@vmgump]: Project commons-lang3-test (in module apache-commons) failed Tue, 06 Mar, 03:34
sebb     Re: [GUMP@vmgump]: Project commons-lang3-test (in module apache-commons) failed Tue, 06 Mar, 11:46
Gary Gregory       Re: [GUMP@vmgump]: Project commons-lang3-test (in module apache-commons) failed Tue, 06 Mar, 12:52
sebb         Re: [GUMP@vmgump]: Project commons-lang3-test (in module apache-commons) failed Tue, 06 Mar, 15:55
Gump   [GUMP@vmgump]: Project commons-lang3-test (in module apache-commons) failed Wed, 07 Mar, 03:32
Gump   [GUMP@vmgump]: Project commons-lang3-test (in module apache-commons) failed Thu, 08 Mar, 03:29
[GUMP@vmgump]: Project commons-scxml-test (in module apache-commons) failed
Gump   [GUMP@vmgump]: Project commons-scxml-test (in module apache-commons) failed Thu, 01 Mar, 05:20
Gump   [GUMP@vmgump]: Project commons-scxml-test (in module apache-commons) failed Fri, 02 Mar, 05:36
Gump   [GUMP@vmgump]: Project commons-scxml-test (in module apache-commons) failed Sat, 03 Mar, 05:11
Gump   [GUMP@vmgump]: Project commons-scxml-test (in module apache-commons) failed Sun, 04 Mar, 05:03
Gump   [GUMP@vmgump]: Project commons-scxml-test (in module apache-commons) failed Mon, 05 Mar, 05:11
Gump   [GUMP@vmgump]: Project commons-scxml-test (in module apache-commons) failed Tue, 06 Mar, 05:17
Gump   [GUMP@vmgump]: Project commons-scxml-test (in module apache-commons) failed Wed, 07 Mar, 05:13
Gump   [GUMP@vmgump]: Project commons-scxml-test (in module apache-commons) failed Thu, 08 Mar, 05:08
Gump   [GUMP@vmgump]: Project commons-scxml-test (in module apache-commons) failed Fri, 09 Mar, 05:15
Gump   [GUMP@vmgump]: Project commons-scxml-test (in module apache-commons) failed Sat, 10 Mar, 05:18
Gump   [GUMP@vmgump]: Project commons-scxml-test (in module apache-commons) failed Sun, 11 Mar, 05:05
Gump   [GUMP@vmgump]: Project commons-scxml-test (in module apache-commons) failed Mon, 12 Mar, 05:04
Gump   [GUMP@vmgump]: Project commons-scxml-test (in module apache-commons) failed Tue, 13 Mar, 05:07
Gump   [GUMP@vmgump]: Project commons-scxml-test (in module apache-commons) failed Wed, 14 Mar, 05:11
Gump   [GUMP@vmgump]: Project commons-scxml-test (in module apache-commons) failed Thu, 15 Mar, 05:19
Gump   [GUMP@vmgump]: Project commons-scxml-test (in module apache-commons) failed Fri, 16 Mar, 04:48
Gump   [GUMP@vmgump]: Project commons-scxml-test (in module apache-commons) failed Sat, 17 Mar, 05:12
Gump   [GUMP@vmgump]: Project commons-scxml-test (in module apache-commons) failed Sun, 18 Mar, 05:11
Gump   [GUMP@vmgump]: Project commons-scxml-test (in module apache-commons) failed Mon, 19 Mar, 05:12
Gump   [GUMP@vmgump]: Project commons-scxml-test (in module apache-commons) failed Tue, 20 Mar, 05:17
Gump   [GUMP@vmgump]: Project commons-scxml-test (in module apache-commons) failed Wed, 21 Mar, 05:08
Gump   [GUMP@vmgump]: Project commons-scxml-test (in module apache-commons) failed Thu, 22 Mar, 06:18
Gump   [GUMP@vmgump]: Project commons-scxml-test (in module apache-commons) failed Fri, 23 Mar, 05:21
Gump   [GUMP@vmgump]: Project commons-scxml-test (in module apache-commons) failed Sat, 24 Mar, 05:16
Gump   [GUMP@vmgump]: Project commons-scxml-test (in module apache-commons) failed Sun, 25 Mar, 05:16
Gump   [GUMP@vmgump]: Project commons-scxml-test (in module apache-commons) failed Mon, 26 Mar, 05:27
Gump   [GUMP@vmgump]: Project commons-scxml-test (in module apache-commons) failed Tue, 27 Mar, 05:15
Gump   [GUMP@vmgump]: Project commons-scxml-test (in module apache-commons) failed Wed, 28 Mar, 05:28
Gump   [GUMP@vmgump]: Project commons-scxml-test (in module apache-commons) failed Thu, 29 Mar, 05:27
Gump   [GUMP@vmgump]: Project commons-scxml-test (in module apache-commons) failed Fri, 30 Mar, 04:56
Gump   [GUMP@vmgump]: Project commons-scxml-test (in module apache-commons) failed Sat, 31 Mar, 05:00
Re: Maven bugs when building Sanselan
Damjan Jovanovic   Re: Maven bugs when building Sanselan Thu, 01 Mar, 05:23
Dennis Lundberg     Re: Maven bugs when building Sanselan Thu, 01 Mar, 19:25
Gary Gregory       Re: Maven bugs when building Sanselan Thu, 01 Mar, 19:43
Gary Gregory       Re: Maven bugs when building Sanselan Thu, 01 Mar, 19:45
Dennis Lundberg         Re: Maven bugs when building Sanselan Thu, 01 Mar, 20:18
Gary Gregory           Re: Maven bugs when building Sanselan Thu, 01 Mar, 20:27
Damjan Jovanovic       Re: Maven bugs when building Sanselan Thu, 01 Mar, 19:59
Dennis Lundberg   Re: Maven bugs when building Sanselan Thu, 01 Mar, 21:37
Damjan Jovanovic     Re: Maven bugs when building Sanselan Fri, 02 Mar, 05:28
sebb       Re: Maven bugs when building Sanselan Fri, 02 Mar, 16:54
Dennis Lundberg         Re: Maven bugs when building Sanselan Sun, 11 Mar, 18:42
Emmanuel Bourg       Re: Maven bugs when building Sanselan Sun, 11 Mar, 21:07
[GUMP@vmgump]: Project commons-configuration-test (in module apache-commons) failed
Gump   [GUMP@vmgump]: Project commons-configuration-test (in module apache-commons) failed Thu, 01 Mar, 06:31
Gump   [GUMP@vmgump]: Project commons-configuration-test (in module apache-commons) failed Fri, 02 Mar, 06:53
Gump   [GUMP@vmgump]: Project commons-configuration-test (in module apache-commons) failed Sat, 03 Mar, 06:25
Gump   [GUMP@vmgump]: Project commons-configuration-test (in module apache-commons) failed Sun, 04 Mar, 06:13
Gump   [GUMP@vmgump]: Project commons-configuration-test (in module apache-commons) failed Mon, 05 Mar, 06:23
Gump   [GUMP@vmgump]: Project commons-configuration-test (in module apache-commons) failed Tue, 06 Mar, 06:25
Gump   [GUMP@vmgump]: Project commons-configuration-test (in module apache-commons) failed Wed, 07 Mar, 06:22
Gump   [GUMP@vmgump]: Project commons-configuration-test (in module apache-commons) failed Thu, 08 Mar, 06:14
Gump   [GUMP@vmgump]: Project commons-configuration-test (in module apache-commons) failed Fri, 09 Mar, 06:34
Gump   [GUMP@vmgump]: Project commons-configuration-test (in module apache-commons) failed Sat, 10 Mar, 06:24
Gump   [GUMP@vmgump]: Project commons-configuration-test (in module apache-commons) failed Sun, 11 Mar, 06:14
Gump   [GUMP@vmgump]: Project commons-configuration-test (in module apache-commons) failed Mon, 12 Mar, 06:10
Gump   [GUMP@vmgump]: Project commons-configuration-test (in module apache-commons) failed Tue, 13 Mar, 06:19
Gump   [GUMP@vmgump]: Project commons-configuration-test (in module apache-commons) failed Wed, 14 Mar, 06:21
Gump   [GUMP@vmgump]: Project commons-configuration-test (in module apache-commons) failed Thu, 15 Mar, 06:28
Gump   [GUMP@vmgump]: Project commons-configuration-test (in module apache-commons) failed Fri, 16 Mar, 05:59
Gump   [GUMP@vmgump]: Project commons-configuration-test (in module apache-commons) failed Sat, 17 Mar, 06:21
Gump   [GUMP@vmgump]: Project commons-configuration-test (in module apache-commons) failed Sun, 18 Mar, 06:18
Gump   [GUMP@vmgump]: Project commons-configuration-test (in module apache-commons) failed Mon, 19 Mar, 06:20
Gump   [GUMP@vmgump]: Project commons-configuration-test (in module apache-commons) failed Tue, 20 Mar, 06:33
Gump   [GUMP@vmgump]: Project commons-configuration-test (in module apache-commons) failed Wed, 21 Mar, 06:24
Gump   [GUMP@vmgump]: Project commons-configuration-test (in module apache-commons) failed Thu, 22 Mar, 07:39
Gump   [GUMP@vmgump]: Project commons-configuration-test (in module apache-commons) failed Fri, 23 Mar, 06:41
Gump   [GUMP@vmgump]: Project commons-configuration-test (in module apache-commons) failed Sat, 24 Mar, 06:29
Gump   [GUMP@vmgump]: Project commons-configuration-test (in module apache-commons) failed Sun, 25 Mar, 07:18
Gump   [GUMP@vmgump]: Project commons-configuration-test (in module apache-commons) failed Mon, 26 Mar, 06:38
Gump   [GUMP@vmgump]: Project commons-configuration-test (in module apache-commons) failed Tue, 27 Mar, 06:31
Gump   [GUMP@vmgump]: Project commons-configuration-test (in module apache-commons) failed Wed, 28 Mar, 06:33
Gump   [GUMP@vmgump]: Project commons-configuration-test (in module apache-commons) failed Thu, 29 Mar, 06:43
Gump   [GUMP@vmgump]: Project commons-configuration-test (in module apache-commons) failed Fri, 30 Mar, 06:13
Gump   [GUMP@vmgump]: Project commons-configuration-test (in module apache-commons) failed Sat, 31 Mar, 06:13
Oliver Heger     Re: [GUMP@vmgump]: Project commons-configuration-test (in module apache-commons) failed Sat, 31 Mar, 19:03
[GUMP@vmgump]: Project commons-proxy-test (in module apache-commons) failed
Gump   [GUMP@vmgump]: Project commons-proxy-test (in module apache-commons) failed Thu, 01 Mar, 06:32
Gump   [GUMP@vmgump]: Project commons-proxy-test (in module apache-commons) failed Fri, 02 Mar, 06:54
Gump   [GUMP@vmgump]: Project commons-proxy-test (in module apache-commons) failed Sat, 03 Mar, 06:26
Gump   [GUMP@vmgump]: Project commons-proxy-test (in module apache-commons) failed Sun, 04 Mar, 06:14
Gump   [GUMP@vmgump]: Project commons-proxy-test (in module apache-commons) failed Mon, 05 Mar, 06:24
Gump   [GUMP@vmgump]: Project commons-proxy-test (in module apache-commons) failed Tue, 06 Mar, 06:26
Gump   [GUMP@vmgump]: Project commons-proxy-test (in module apache-commons) failed Wed, 07 Mar, 06:23
Gump   [GUMP@vmgump]: Project commons-proxy-test (in module apache-commons) failed Thu, 08 Mar, 06:15
Gump   [GUMP@vmgump]: Project commons-proxy-test (in module apache-commons) failed Fri, 09 Mar, 06:35
Gump   [GUMP@vmgump]: Project commons-proxy-test (in module apache-commons) failed Sat, 10 Mar, 06:25
Gump   [GUMP@vmgump]: Project commons-proxy-test (in module apache-commons) failed Sun, 11 Mar, 06:15
Gump   [GUMP@vmgump]: Project commons-proxy-test (in module apache-commons) failed Mon, 12 Mar, 06:12
Gump   [GUMP@vmgump]: Project commons-proxy-test (in module apache-commons) failed Tue, 13 Mar, 06:21
Gump   [GUMP@vmgump]: Project commons-proxy-test (in module apache-commons) failed Wed, 14 Mar, 06:23
Gump   [GUMP@vmgump]: Project commons-proxy-test (in module apache-commons) failed Thu, 15 Mar, 06:30
Gump   [GUMP@vmgump]: Project commons-proxy-test (in module apache-commons) failed Fri, 16 Mar, 06:01
Gump   [GUMP@vmgump]: Project commons-proxy-test (in module apache-commons) failed Sat, 17 Mar, 06:22
Gump   [GUMP@vmgump]: Project commons-proxy-test (in module apache-commons) failed Sun, 18 Mar, 06:20
Gump   [GUMP@vmgump]: Project commons-proxy-test (in module apache-commons) failed Mon, 19 Mar, 06:22
Gump   [GUMP@vmgump]: Project commons-proxy-test (in module apache-commons) failed Tue, 20 Mar, 06:34
Gump   [GUMP@vmgump]: Project commons-proxy-test (in module apache-commons) failed Wed, 21 Mar, 06:26
Gump   [GUMP@vmgump]: Project commons-proxy-test (in module apache-commons) failed Thu, 22 Mar, 07:41
Gump   [GUMP@vmgump]: Project commons-proxy-test (in module apache-commons) failed Fri, 23 Mar, 06:44
Gump   [GUMP@vmgump]: Project commons-proxy-test (in module apache-commons) failed Sat, 24 Mar, 06:31
Gump   [GUMP@vmgump]: Project commons-proxy-test (in module apache-commons) failed Sun, 25 Mar, 07:20
Gump   [GUMP@vmgump]: Project commons-proxy-test (in module apache-commons) failed Mon, 26 Mar, 06:41
Gump   [GUMP@vmgump]: Project commons-proxy-test (in module apache-commons) failed Tue, 27 Mar, 06:33
Gump   [GUMP@vmgump]: Project commons-proxy-test (in module apache-commons) failed Wed, 28 Mar, 06:36
Gump   [GUMP@vmgump]: Project commons-proxy-test (in module apache-commons) failed Thu, 29 Mar, 06:46
Gump   [GUMP@vmgump]: Project commons-proxy-test (in module apache-commons) failed Fri, 30 Mar, 06:15
Gump   [GUMP@vmgump]: Project commons-proxy-test (in module apache-commons) failed Sat, 31 Mar, 06:15
[GUMP@vmgump]: Project commons-vfs2-test (in module apache-commons) failed
Gump   [GUMP@vmgump]: Project commons-vfs2-test (in module apache-commons) failed Thu, 01 Mar, 07:08
Gump   [GUMP@vmgump]: Project commons-vfs2-test (in module apache-commons) failed Fri, 02 Mar, 07:26
Gump   [GUMP@vmgump]: Project commons-vfs2-test (in module apache-commons) failed Sat, 03 Mar, 06:59
Gump   [GUMP@vmgump]: Project commons-vfs2-test (in module apache-commons) failed Sun, 04 Mar, 06:46
Gump   [GUMP@vmgump]: Project commons-vfs2-test (in module apache-commons) failed Mon, 05 Mar, 07:00
Gump   [GUMP@vmgump]: Project commons-vfs2-test (in module apache-commons) failed Tue, 06 Mar, 07:01
Gump   [GUMP@vmgump]: Project commons-vfs2-test (in module apache-commons) failed Wed, 07 Mar, 07:00
Gump   [GUMP@vmgump]: Project commons-vfs2-test (in module apache-commons) failed Thu, 08 Mar, 06:54
Gump   [GUMP@vmgump]: Project commons-vfs2-test (in module apache-commons) failed Fri, 09 Mar, 07:10
Gump   [GUMP@vmgump]: Project commons-vfs2-test (in module apache-commons) failed Sat, 10 Mar, 07:00
Gump   [GUMP@vmgump]: Project commons-vfs2-test (in module apache-commons) failed Sun, 11 Mar, 06:49
Gump   [GUMP@vmgump]: Project commons-vfs2-test (in module apache-commons) failed Mon, 12 Mar, 06:49
Gump   [GUMP@vmgump]: Project commons-vfs2-test (in module apache-commons) failed Tue, 13 Mar, 06:59
Gump   [GUMP@vmgump]: Project commons-vfs2-test (in module apache-commons) failed Wed, 14 Mar, 06:52
Gump   [GUMP@vmgump]: Project commons-vfs2-test (in module apache-commons) failed Thu, 15 Mar, 07:03
Gump   [GUMP@vmgump]: Project commons-vfs2-test (in module apache-commons) failed Fri, 16 Mar, 06:35
Gump   [GUMP@vmgump]: Project commons-vfs2-test (in module apache-commons) failed Sat, 17 Mar, 06:58
Gump   [GUMP@vmgump]: Project commons-vfs2-test (in module apache-commons) failed Sun, 18 Mar, 06:56
Gump   [GUMP@vmgump]: Project commons-vfs2-test (in module apache-commons) failed Mon, 19 Mar, 06:58
Gump   [GUMP@vmgump]: Project commons-vfs2-test (in module apache-commons) failed Tue, 20 Mar, 07:10
Gump   [GUMP@vmgump]: Project commons-vfs2-test (in module apache-commons) failed Wed, 21 Mar, 07:02
Gump   [GUMP@vmgump]: Project commons-vfs2-test (in module apache-commons) failed Thu, 22 Mar, 08:16
Gump   [GUMP@vmgump]: Project commons-vfs2-test (in module apache-commons) failed Fri, 23 Mar, 07:21
Gump   [GUMP@vmgump]: Project commons-vfs2-test (in module apache-commons) failed Sat, 24 Mar, 07:03
Gump   [GUMP@vmgump]: Project commons-vfs2-test (in module apache-commons) failed Sun, 25 Mar, 07:51
Gump   [GUMP@vmgump]: Project commons-vfs2-test (in module apache-commons) failed Mon, 26 Mar, 07:13
Gump   [GUMP@vmgump]: Project commons-vfs2-test (in module apache-commons) failed Tue, 27 Mar, 07:05
Gump   [GUMP@vmgump]: Project commons-vfs2-test (in module apache-commons) failed Wed, 28 Mar, 07:09
Gump   [GUMP@vmgump]: Project commons-vfs2-test (in module apache-commons) failed Thu, 29 Mar, 07:21
Gump   [GUMP@vmgump]: Project commons-vfs2-test (in module apache-commons) failed Fri, 30 Mar, 06:45
Gump   [GUMP@vmgump]: Project commons-vfs2-test (in module apache-commons) failed Sat, 31 Mar, 06:44
Re: [graph] Doubts on DFS algorithm implementation
Marco Speranza   Re: [graph] Doubts on DFS algorithm implementation Thu, 01 Mar, 07:34
Thomas Neidhart     Re: [graph] Doubts on DFS algorithm implementation Thu, 01 Mar, 07:59
Simone Tripodi       Re: [graph] Doubts on DFS algorithm implementation Thu, 01 Mar, 08:10
Thomas Neidhart         Re: [graph] Doubts on DFS algorithm implementation Thu, 01 Mar, 17:45
Marco Speranza           Re: [graph] Doubts on DFS algorithm implementation Thu, 01 Mar, 18:06
Thomas Neidhart             Re: [graph] Doubts on DFS algorithm implementation Thu, 01 Mar, 18:32
Marco Speranza               Re: [graph] Doubts on DFS algorithm implementation Thu, 01 Mar, 18:38
Simone Tripodi                 Re: [graph] Doubts on DFS algorithm implementation Thu, 01 Mar, 19:45
Claudio Squarcella               Re: [graph] Doubts on DFS algorithm implementation Thu, 01 Mar, 22:06
Marco Speranza       Re: [graph] Doubts on DFS algorithm implementation Thu, 01 Mar, 08:15
Re: svn commit: r1295244 - /commons/sandbox/graph/trunk/src/main/java/org/apache/commons/graph/visit/DefaultVisitAlgorithmsSelector.java
Simone Tripodi   Re: svn commit: r1295244 - /commons/sandbox/graph/trunk/src/main/java/org/apache/commons/graph/visit/DefaultVisitAlgorithmsSelector.java Thu, 01 Mar, 07:40
Contin...@vmbuild [continuum] BUILD FAILURE: Apache Commons - Commons Math - Default Maven 2 Build Definition (Java 1.5) Thu, 01 Mar, 12:29
sebb   Re: [continuum] BUILD FAILURE: Apache Commons - Commons Math - Default Maven 2 Build Definition (Java 1.5) Thu, 01 Mar, 12:33
Gilles Sadowski   Re: [continuum] BUILD FAILURE: Apache Commons - Commons Math - Default Maven 2 Build Definition (Java 1.5) Thu, 01 Mar, 12:55
sebb     Re: [continuum] BUILD FAILURE: Apache Commons - Commons Math - Default Maven 2 Build Definition (Java 1.5) Thu, 01 Mar, 13:03
Re: svn commit: r1295533 - in /commons/proper/math/trunk: ./ src/main/java/org/apache/commons/math3/linear/ src/test/java/org/apache/commons/math3/linear/ src/test/java/org/apache/commons/math3/optimization/
sebb   Re: svn commit: r1295533 - in /commons/proper/math/trunk: ./ src/main/java/org/apache/commons/math3/linear/ src/test/java/org/apache/commons/math3/linear/ src/test/java/org/apache/commons/math3/optimization/ Thu, 01 Mar, 12:49
Gilles Sadowski     Re: svn commit: r1295533 - in /commons/proper/math/trunk: ./ src/main/java/org/apache/commons/math3/linear/ src/test/java/org/apache/commons/math3/linear/ src/test/java/org/apache/commons/math3/optimization/ Thu, 01 Mar, 13:12
sebb       Re: svn commit: r1295533 - in /commons/proper/math/trunk: ./ src/main/java/org/apache/commons/math3/linear/ src/test/java/org/apache/commons/math3/linear/ src/test/java/org/apache/commons/math3/optimization/ Thu, 01 Mar, 14:58
Gilles Sadowski         Re: svn commit: r1295533 - in /commons/proper/math/trunk: ./ src/main/java/org/apache/commons/math3/linear/ src/test/java/org/apache/commons/math3/linear/ src/test/java/org/apache/commons/math3/optimization/ Thu, 01 Mar, 15:44
Re: [VOTE][Lang] Update to Java 6
Gary Gregory   Re: [VOTE][Lang] Update to Java 6 Thu, 01 Mar, 13:34
Benedikt Ritter [SANDBOX][BeanUtils2] Improve implemenation of equals() on AccessibleObjectDescriptor Thu, 01 Mar, 14:09
Simone Tripodi   Re: [SANDBOX][BeanUtils2] Improve implemenation of equals() on AccessibleObjectDescriptor Thu, 01 Mar, 14:49
Benedikt Ritter     Re: [SANDBOX][BeanUtils2] Improve implemenation of equals() on AccessibleObjectDescriptor Thu, 01 Mar, 15:07
Simone Tripodi       Re: [SANDBOX][BeanUtils2] Improve implemenation of equals() on AccessibleObjectDescriptor Thu, 01 Mar, 16:11
Benedikt Ritter         Re: [SANDBOX][BeanUtils2] Improve implemenation of equals() on AccessibleObjectDescriptor Thu, 01 Mar, 17:04
Simone Tripodi           Re: [SANDBOX][BeanUtils2] Improve implemenation of equals() on AccessibleObjectDescriptor Thu, 01 Mar, 19:52
Benedikt Ritter             Re: [SANDBOX][BeanUtils2] Improve implemenation of equals() on AccessibleObjectDescriptor Thu, 01 Mar, 21:27
Gilles Sadowski [Math] New warnings from "FindBugs" Thu, 01 Mar, 14:16
Gilles Sadowski   Re: [Math] New warnings from "FindBugs" Thu, 01 Mar, 14:33
Sébastien Brisard   Re: [Math] New warnings from "FindBugs" Thu, 01 Mar, 16:05
Gilles Sadowski     Re: [Math] New warnings from "FindBugs" Thu, 01 Mar, 17:19
Gilles Sadowski       Re: [Math] New warnings from "FindBugs" Thu, 01 Mar, 22:26
Sébastien Brisard         Re: [Math] New warnings from "FindBugs" Fri, 02 Mar, 06:22
Gilles Sadowski           Re: [Math] New warnings from "FindBugs" Fri, 02 Mar, 14:33
Luc Maisonobe   Re: [Math] New warnings from "FindBugs" Thu, 01 Mar, 20:29
Gilles Sadowski     Re: [Math] New warnings from "FindBugs" Thu, 01 Mar, 22:27
Gary Gregory [IO] Ready for a release? Thu, 01 Mar, 15:07
Re: [chain] release roadmap
Elijah Zupancic   Re: [chain] release roadmap Thu, 01 Mar, 16:33
Simone Tripodi     Re: [chain] release roadmap Thu, 01 Mar, 16:37
Elijah Zupancic       Re: [chain] release roadmap Fri, 02 Mar, 06:52
Simone Tripodi         Re: [chain] release roadmap Fri, 02 Mar, 07:58
Elijah Zupancic           Re: [chain] release roadmap Sun, 04 Mar, 03:45
Simone Tripodi             Re: [chain] release roadmap Sun, 04 Mar, 13:16
[continuum] BUILD FAILURE: Apache Commons - Commons Sanselan - Default Maven 2 Build Definition (Java 1.5)
Contin...@vmbuild   [continuum] BUILD FAILURE: Apache Commons - Commons Sanselan - Default Maven 2 Build Definition (Java 1.5) Thu, 01 Mar, 19:11
Contin...@vmbuild   [continuum] BUILD FAILURE: Apache Commons - Commons Sanselan - Default Maven 2 Build Definition (Java 1.5) Fri, 30 Mar, 17:21
Contin...@vmbuild   [continuum] BUILD FAILURE: Apache Commons - Commons Sanselan - Default Maven 2 Build Definition (Java 1.5) Fri, 30 Mar, 17:26
Contin...@vmbuild   [continuum] BUILD FAILURE: Apache Commons - Commons Sanselan - Default Maven 2 Build Definition (Java 1.5) Fri, 30 Mar, 17:27
Contin...@vmbuild   [continuum] BUILD FAILURE: Apache Commons - Commons Sanselan - Default Maven 2 Build Definition (Java 1.5) Fri, 30 Mar, 19:23
Contin...@vmbuild   [continuum] BUILD FAILURE: Apache Commons - Commons Sanselan - Default Maven 2 Build Definition (Java 1.5) Fri, 30 Mar, 21:20
Contin...@vmbuild   [continuum] BUILD FAILURE: Apache Commons - Commons Sanselan - Default Maven 2 Build Definition (Java 1.5) Fri, 30 Mar, 23:20
Re: Karma for Continuum on vmbuild
Dennis Lundberg   Re: Karma for Continuum on vmbuild Thu, 01 Mar, 19:15
Re: svn commit: r1295694 - /commons/sandbox/graph/trunk/src/main/java/org/apache/commons/graph/visit/DefaultVisitAlgorithmsSelector.java
Simone Tripodi   Re: svn commit: r1295694 - /commons/sandbox/graph/trunk/src/main/java/org/apache/commons/graph/visit/DefaultVisitAlgorithmsSelector.java Thu, 01 Mar, 19:43
Thomas Neidhart [graph] Kosaraju's SCC algorithm Thu, 01 Mar, 20:26
Marco Speranza   Re: [graph] Kosaraju's SCC algorithm Thu, 01 Mar, 21:18
Re: svn commit: r1295773 - in /commons/sandbox/graph/trunk/src: main/java/org/apache/commons/graph/scc/ test/java/org/apache/commons/graph/scc/
Simone Tripodi   Re: svn commit: r1295773 - in /commons/sandbox/graph/trunk/src: main/java/org/apache/commons/graph/scc/ test/java/org/apache/commons/graph/scc/ Thu, 01 Mar, 20:31
Oliver Heger [configuration] Replace DatabaseConfiguration with version from branch? Thu, 01 Mar, 21:03
Emmanuel Bourg   Re: [configuration] Replace DatabaseConfiguration with version from branch? Mon, 05 Mar, 17:14
Oliver Heger     Re: [configuration] Replace DatabaseConfiguration with version from branch? Mon, 05 Mar, 20:51
Re: svn commit: r1295924 - in /commons/sandbox/graph/trunk/src: changes/changes.xml main/java/org/apache/commons/graph/scc/DefaultSccAlgorithmSelector.java test/java/org/apache/commons/graph/scc/KosarajuSharirTestCase.java
Simone Tripodi   Re: svn commit: r1295924 - in /commons/sandbox/graph/trunk/src: changes/changes.xml main/java/org/apache/commons/graph/scc/DefaultSccAlgorithmSelector.java test/java/org/apache/commons/graph/scc/KosarajuSharirTestCase.java Thu, 01 Mar, 22:08
Gary Gregory [RESULT][VOTE][Lang] Update to Java 6 Thu, 01 Mar, 23:13
Christian Grobmeier   Re: [RESULT][VOTE][Lang] Update to Java 6 Thu, 01 Mar, 23:15
[continuum] BUILD FAILURE: Apache Commons - Apache Commons Digester - Default Maven 2 Build Definition (Java 1.5)
Contin...@vmbuild   [continuum] BUILD FAILURE: Apache Commons - Apache Commons Digester - Default Maven 2 Build Definition (Java 1.5) Thu, 01 Mar, 23:23
Contin...@vmbuild   [continuum] BUILD FAILURE: Apache Commons - Apache Commons Digester - Default Maven 2 Build Definition (Java 1.5) Thu, 15 Mar, 10:21
Contin...@vmbuild   [continuum] BUILD FAILURE: Apache Commons - Apache Commons Digester - Default Maven 2 Build Definition (Java 1.5) Thu, 15 Mar, 11:21
Contin...@vmbuild   [continuum] BUILD FAILURE: Apache Commons - Apache Commons Digester - Default Maven 2 Build Definition (Java 1.5) Thu, 15 Mar, 15:21
Contin...@vmbuild   [continuum] BUILD FAILURE: Apache Commons - Apache Commons Digester - Default Maven 2 Build Definition (Java 1.5) Thu, 15 Mar, 20:21
Contin...@vmbuild   [continuum] BUILD FAILURE: Apache Commons - Apache Commons Digester - Default Maven 2 Build Definition (Java 1.5) Thu, 15 Mar, 22:21
Contin...@vmbuild   [continuum] BUILD FAILURE: Apache Commons - Apache Commons Digester - Default Maven 2 Build Definition (Java 1.5) Fri, 16 Mar, 14:21
Contin...@vmbuild   [continuum] BUILD FAILURE: Apache Commons - Apache Commons Digester - Default Maven 2 Build Definition (Java 1.5) Fri, 16 Mar, 23:21
Contin...@vmbuild   [continuum] BUILD FAILURE: Apache Commons - Apache Commons Digester - Default Maven 2 Build Definition (Java 1.5) Mon, 19 Mar, 10:21
Gilles Sadowski [Math] More missing/confusing infos in "UsingNexus" Fri, 02 Mar, 00:43
Christian Grobmeier   Re: [Math] More missing/confusing infos in "UsingNexus" Fri, 02 Mar, 15:55
Gilles Sadowski [Math] Toward 3.0 release: First deliverables Fri, 02 Mar, 00:59
Bruce A Johnson   Re: [Math] Toward 3.0 release: First deliverables Fri, 02 Mar, 01:04
Hendriks, D.   RE: [Math] Toward 3.0 release: First deliverables Fri, 02 Mar, 07:20
Sébastien Brisard     Re: [Math] Toward 3.0 release: First deliverables Fri, 02 Mar, 07:33
Gilles Sadowski       Re: [Math] Toward 3.0 release: First deliverables Fri, 02 Mar, 10:50
sebb         Re: [Math] Toward 3.0 release: First deliverables Fri, 02 Mar, 17:41
sebb           Re: [Math] Toward 3.0 release: First deliverables Fri, 02 Mar, 18:40
Gilles Sadowski           Re: [Math] Toward 3.0 release: First deliverables Fri, 02 Mar, 20:36
sebb             Re: [Math] Toward 3.0 release: First deliverables Fri, 02 Mar, 20:41
sebb   Re: [Math] Toward 3.0 release: First deliverables Fri, 02 Mar, 23:41
Luc Maisonobe     Re: [Math] Toward 3.0 release: First deliverables Sat, 03 Mar, 13:36
James Carman [graph] Why the Vertex/Edge Interfaces? Fri, 02 Mar, 01:41
Simone Tripodi   Re: [graph] Why the Vertex/Edge Interfaces? Fri, 02 Mar, 07:35
James Carman     Re: [graph] Why the Vertex/Edge Interfaces? Fri, 02 Mar, 07:48
James Carman [graph] Why the Vertex and Edge interfaces? Fri, 02 Mar, 01:45
Simone Tripodi   Re: [graph] Why the Vertex and Edge interfaces? Fri, 02 Mar, 07:47
James Carman     Re: [graph] Why the Vertex and Edge interfaces? Fri, 02 Mar, 07:50
Simone Tripodi       Re: [graph] Why the Vertex and Edge interfaces? Fri, 02 Mar, 08:08
Claudio Squarcella     Re: [graph] Why the Vertex and Edge interfaces? Fri, 02 Mar, 08:40
James Ring       Re: [graph] Why the Vertex and Edge interfaces? Fri, 02 Mar, 17:42
Ted Dunning       Re: [graph] Why the Vertex and Edge interfaces? Fri, 02 Mar, 20:07
Simone Tripodi         Re: [graph] Why the Vertex and Edge interfaces? Fri, 02 Mar, 20:25
Ted Dunning           Re: [graph] Why the Vertex and Edge interfaces? Fri, 02 Mar, 20:30
Simone Tripodi             Re: [graph] Why the Vertex and Edge interfaces? Fri, 02 Mar, 20:35
James Carman         Re: [graph] Why the Vertex and Edge interfaces? Fri, 02 Mar, 21:09
Simone Tripodi           Re: [graph] Why the Vertex and Edge interfaces? Fri, 02 Mar, 21:14
Simone Tripodi             Re: [graph] Why the Vertex and Edge interfaces? Fri, 02 Mar, 21:14
Claudio Squarcella           Re: [graph] Why the Vertex and Edge interfaces? Fri, 02 Mar, 21:22
Simone Tripodi             Re: [graph] Why the Vertex and Edge interfaces? Fri, 02 Mar, 22:02
Simone Tripodi               Re: [graph] Why the Vertex and Edge interfaces? Fri, 02 Mar, 22:50
James Carman                 Re: [graph] Why the Vertex and Edge interfaces? Sat, 03 Mar, 00:12
Simone Tripodi                   Re: [graph] Why the Vertex and Edge interfaces? Sat, 03 Mar, 00:32
Claudio Squarcella               Re: [graph] Why the Vertex and Edge interfaces? Sat, 03 Mar, 00:37
Simone Tripodi                 Re: [graph] Why the Vertex and Edge interfaces? Sat, 03 Mar, 01:21
Claudio Squarcella                   Re: [graph] Why the Vertex and Edge interfaces? Sat, 03 Mar, 12:43
Simone Tripodi                     Re: [graph] Why the Vertex and Edge interfaces? Sat, 03 Mar, 13:15
Claudio Squarcella                       Re: [graph] Why the Vertex and Edge interfaces? Sat, 03 Mar, 13:58
Simone Tripodi                         Re: [graph] Why the Vertex and Edge interfaces? Sat, 03 Mar, 15:47
James Carman                           Re: [graph] Why the Vertex and Edge interfaces? Sat, 03 Mar, 16:01
Simone Tripodi                             Re: [graph] Why the Vertex and Edge interfaces? Sat, 03 Mar, 16:02
Oliver Heger                           Re: [graph] Why the Vertex and Edge interfaces? Sat, 03 Mar, 16:03
Simone Tripodi                             Re: [graph] Why the Vertex and Edge interfaces? Sat, 03 Mar, 16:10
Claudio Squarcella                           Re: [graph] Why the Vertex and Edge interfaces? Sat, 03 Mar, 16:11
Simone Tripodi                             Re: [graph] Why the Vertex and Edge interfaces? Sat, 03 Mar, 16:13
Simone Tripodi                             Re: [graph] Why the Vertex and Edge interfaces? Sat, 03 Mar, 16:19
James Carman                               Re: [graph] Why the Vertex and Edge interfaces? Sun, 04 Mar, 01:10
Simone Tripodi                                 Re: [graph] Why the Vertex and Edge interfaces? Sun, 04 Mar, 13:12
James Carman                                   Re: [graph] Why the Vertex and Edge interfaces? Sun, 04 Mar, 13:19
Benedikt Ritter [SANDBOX][BeanUtils2] Util class for testing Fri, 02 Mar, 09:17
Simone Tripodi   Re: [SANDBOX][BeanUtils2] Util class for testing Fri, 02 Mar, 12:22
Benedikt Ritter     Re: [SANDBOX][BeanUtils2] Util class for testing Fri, 02 Mar, 12:28
Simone Tripodi       Re: [SANDBOX][BeanUtils2] Util class for testing Fri, 02 Mar, 12:51
Emmanuel Bourg [daemon] Debian patches Fri, 02 Mar, 11:32
Damien Raude-Morvan   Re: [daemon] Debian patches Fri, 02 Mar, 15:50
Gary Gregory [commons-build-plugin] commons.release.3.* ? Fri, 02 Mar, 15:19
sebb   Re: [commons-build-plugin] commons.release.3.* ? Fri, 02 Mar, 17:05
sebb     Re: [commons-build-plugin] commons.release.3.* ? Fri, 02 Mar, 17:12
Gary Gregory       Re: [commons-build-plugin] commons.release.3.* ? Fri, 02 Mar, 21:03
[continuum] BUILD FAILURE: Apache Commons - Commons Lang - Default Maven 2 Build Definition (Java 1.5)
Contin...@vmbuild   [continuum] BUILD FAILURE: Apache Commons - Commons Lang - Default Maven 2 Build Definition (Java 1.5) Fri, 02 Mar, 16:22
Contin...@vmbuild   [continuum] BUILD FAILURE: Apache Commons - Commons Lang - Default Maven 2 Build Definition (Java 1.5) Sun, 04 Mar, 11:22
Contin...@vmbuild   [continuum] BUILD FAILURE: Apache Commons - Commons Lang - Default Maven 2 Build Definition (Java 1.5) Mon, 05 Mar, 12:23
Marco Speranza [Graph] Test problems after last commit Fri, 02 Mar, 18:10
Simone Tripodi   Re: [Graph] Test problems after last commit Fri, 02 Mar, 18:32
Marco Speranza     Re: [Graph] Test problems after last commit Fri, 02 Mar, 18:43
Simone Tripodi       Re: [Graph] Test problems after last commit Fri, 02 Mar, 19:11
Marco Speranza         Re: [Graph] Test problems after last commit Fri, 02 Mar, 19:53
Simone Tripodi           Re: [Graph] Test problems after last commit Fri, 02 Mar, 20:19
Simone Tripodi             Re: [Graph] Test problems after last commit Fri, 02 Mar, 20:34
Simone Tripodi               Re: [Graph] Test problems after last commit Fri, 02 Mar, 21:22
Marco Speranza               Re: [Graph] Test problems after last commit Fri, 02 Mar, 21:22
Simone Tripodi                 Re: [Graph] Test problems after last commit Fri, 02 Mar, 21:36
Marco Speranza                   Re: [Graph] Test problems after last commit Fri, 02 Mar, 21:40
Simone Tripodi                     Re: [Graph] Test problems after last commit Fri, 02 Mar, 22:07
Marco Speranza                       Re: [Graph] Test problems after last commit Fri, 02 Mar, 23:33
Simone Tripodi                         Re: [Graph] Test problems after last commit Fri, 02 Mar, 23:45
Marco Speranza                           Re: [Graph] Test problems after last commit Sat, 03 Mar, 00:01
Simone Tripodi                             Re: [Graph] Test problems after last commit Sat, 03 Mar, 00:10
Marco Speranza                               Re: [Graph] Test problems after last commit Sat, 03 Mar, 00:16
Simone Tripodi                                 Re: [Graph] Test problems after last commit Sat, 03 Mar, 00:29
Marco Speranza                                 Re: [Graph] Test problems after last commit Sat, 03 Mar, 00:40
Simone Tripodi                                 Re: [Graph] Test problems after last commit Sat, 03 Mar, 00:56
Simone Tripodi                                   Re: [Graph] Test problems after last commit Sat, 03 Mar, 12:50
Marco Speranza                                     Re: [Graph] Test problems after last commit Sat, 03 Mar, 13:13
Simone Tripodi                                       Re: [Graph] Test problems after last commit Sat, 03 Mar, 13:34
James Carman                                         Re: [Graph] Test problems after last commit Sat, 03 Mar, 13:40
Marco Speranza                                           Re: [Graph] Test problems after last commit Sat, 03 Mar, 14:34
James Carman                                             Re: [Graph] Test problems after last commit Sat, 03 Mar, 14:37
Marco Speranza                                         Re: [Graph] Test problems after last commit Sat, 03 Mar, 14:29
Simone Tripodi                                           Re: [Graph] Test problems after last commit Sat, 03 Mar, 14:53
Simone Tripodi                                             Re: [Graph] Test problems after last commit Sat, 03 Mar, 16:24
Marco Speranza                                               Re: [Graph] Test problems after last commit Sun, 04 Mar, 14:22
Simone Tripodi                                                 Re: [Graph] Test problems after last commit Sun, 04 Mar, 17:08
James Carman                             Re: [Graph] Test problems after last commit Sat, 03 Mar, 00:16
Re: svn commit: r1296359 - in /commons/proper/math/trunk: RELEASE-NOTES.txt pom.xml src/changes/ src/changes/changes.xml src/site/xdoc/changes.xml
Gilles Sadowski   Re: svn commit: r1296359 - in /commons/proper/math/trunk: RELEASE-NOTES.txt pom.xml src/changes/ src/changes/changes.xml src/site/xdoc/changes.xml Fri, 02 Mar, 20:29
sebb     Re: svn commit: r1296359 - in /commons/proper/math/trunk: RELEASE-NOTES.txt pom.xml src/changes/ src/changes/changes.xml src/site/xdoc/changes.xml Fri, 02 Mar, 20:44
sebb       Re: svn commit: r1296359 - in /commons/proper/math/trunk: RELEASE-NOTES.txt pom.xml src/changes/ src/changes/changes.xml src/site/xdoc/changes.xml Fri, 02 Mar, 20:46
Gary Gregory [commons-build-plugin] can't build RC - help out of Maven pit Fri, 02 Mar, 22:44
Christian Grobmeier   Re: [commons-build-plugin] can't build RC - help out of Maven pit Fri, 02 Mar, 22:50
Gary Gregory     Re: [commons-build-plugin] can't build RC - help out of Maven pit Sat, 03 Mar, 01:33
Re: svn commit: r1296508 - /commons/proper/math/trunk/pom.xml
sebb   Re: svn commit: r1296508 - /commons/proper/math/trunk/pom.xml Fri, 02 Mar, 23:34
Re: svn commit: r1296530 - in /commons/sandbox/graph/trunk: pom.xml src/main/java/org/apache/commons/graph/CommonsGraph.java src/test/java/org/apache/commons/graph/model/BaseMutableGraphTestCase.java
Simone Tripodi   Re: svn commit: r1296530 - in /commons/sandbox/graph/trunk: pom.xml src/main/java/org/apache/commons/graph/CommonsGraph.java src/test/java/org/apache/commons/graph/model/BaseMutableGraphTestCase.java Sat, 03 Mar, 00:55
Simone Tripodi     Re: svn commit: r1296530 - in /commons/sandbox/graph/trunk: pom.xml src/main/java/org/apache/commons/graph/CommonsGraph.java src/test/java/org/apache/commons/graph/model/BaseMutableGraphTestCase.java Sat, 03 Mar, 01:09
Message list1 · 2 · 3 · 4 · 5 · 6 · Next »Thread · Author · Date
Box list
Nov 2014242
Oct 2014447
Sep 2014283
Aug 2014191
Jul 2014349
Jun 2014310
May 2014468
Apr 2014428
Mar 2014311
Feb 2014535
Jan 2014561
Dec 2013321
Nov 2013542
Oct 20131116
Sep 2013203
Aug 2013639
Jul 2013472
Jun 2013364
May 2013381
Apr 2013381
Mar 2013944
Feb 2013421
Jan 2013654
Dec 2012720
Nov 2012609
Oct 2012461
Sep 2012706
Aug 2012783
Jul 2012665
Jun 2012670
May 2012479
Apr 2012491
Mar 20121283
Feb 2012810
Jan 2012602
Dec 2011885
Nov 2011685
Oct 2011789
Sep 2011928
Aug 20111048
Jul 2011823
Jun 2011590
May 2011661
Apr 2011764
Mar 2011788
Feb 2011506
Jan 2011707
Dec 2010360
Nov 2010734
Oct 2010694
Sep 2010557
Aug 2010611
Jul 2010438
Jun 2010264
May 2010209
Apr 2010371
Mar 2010663
Feb 2010326
Jan 2010376
Dec 2009308
Nov 2009486
Oct 2009339
Sep 2009286
Aug 2009467
Jul 2009411
Jun 2009420
May 2009804
Apr 2009501
Mar 2009659
Feb 2009419
Jan 2009461
Dec 2008295
Nov 2008294
Oct 2008247
Sep 2008171
Aug 2008198
Jul 2008218
Jun 2008377
May 2008676
Apr 20081093
Mar 2008741
Feb 2008653
Jan 2008880
Dec 2007268
Nov 2007374
Oct 2007280
Sep 2007261
Aug 2007451
Jul 20071189
Jun 2007970
May 2007982
Apr 2007715
Mar 2007720
Feb 2007876
Jan 20071026
Dec 20061008
Nov 20061579
Oct 2006890
Sep 2006643
Aug 2006995
Jul 20061542
Jun 2006750
May 20061059
Apr 20061280
Mar 20061782
Feb 20061147
Jan 20061351
Dec 20051531
Nov 20051520
Oct 20051020
Sep 20051068
Aug 20051757
Jul 20051166
Jun 20051478
May 20051309
Apr 2005925
Mar 20051063
Feb 20051528
Jan 20051715
Dec 20041414
Nov 20041732
Oct 20041649
Sep 20042039
Aug 20041449
Jul 20041239
Jun 20041923
May 20041967
Apr 20041481
Mar 20042020
Feb 20041944
Jan 20041969
Dec 20031510
Nov 20032060
Oct 20032096
Sep 20032048
Aug 20031901
Jul 20031556
Jun 20031833
May 20031441
Apr 20031378
Mar 20031394
Feb 20031441
Jan 20032603
Dec 20021234
Nov 20021437
Oct 20022149
Sep 20021572
Aug 20022411
Jul 20022394
Jun 20021965
May 20021124
Apr 20021334
Mar 2002991
Feb 20021720
Jan 20021856
Dec 2001512
Nov 2001266
Oct 200119