commons-dev mailing list archives

Site index · List index
Message view « Date » · « Thread »
Top « Date » · « Thread »
From Gump <iss...@commons.apache.org>
Subject [GUMP@vmgump]: Project commons-id (in module commons-sandbox) failed
Date Sun, 18 Mar 2012 06:43:06 GMT
To whom it may engage...
        
This is an automated request, but not an unsolicited one. For 
more information please visit http://gump.apache.org/nagged.html, 
and/or contact the folk at general@gump.apache.org.

Project commons-id has an issue affecting its community integration.
This issue affects 1 projects,
 and has been outstanding for 12 runs.
The current state of this project is 'Failed', with reason 'Build Failed'.
For reference only, the following projects are affected by this:
    - commons-id :  Commons Identifier Package


Full details are available at:
    http://vmgump.apache.org/gump/public/commons-sandbox/commons-id/index.html

That said, some information snippets are provided here.

The following annotations (debug/informational/warning/error messages) were provided:
 -DEBUG- Sole jar output [commons-id-18032012.jar] identifier set to project name
 -DEBUG- (Apache Gump generated) Apache Maven Properties in: /srv/gump/public/workspace/commons-sandbox/id/build.properties
 -INFO- Failed with reason build failed
 -DEBUG- Maven POM in: /srv/gump/public/workspace/commons-sandbox/id/project.xml
 -DEBUG- Maven project properties in: /srv/gump/public/workspace/commons-sandbox/id/project.properties
 -INFO- Failed to extract fallback artifacts from Gump Repository



The following work was performed:
http://vmgump.apache.org/gump/public/commons-sandbox/commons-id/gump_work/build_commons-sandbox_commons-id.html
Work Name: build_commons-sandbox_commons-id (Type: Build)
Work ended in a state of : Failed
Elapsed: 46 secs
Command Line: maven --offline jar 
[Working Directory: /srv/gump/public/workspace/commons-sandbox/id]
---------------------------------------------
    [junit] Tests run: 2, Failures: 0, Errors: 0, Time elapsed: 17.102 sec
    [junit] Running org.apache.commons.id.uuid.state.NodeTest
    [junit] Tests run: 8, Failures: 0, Errors: 0, Time elapsed: 0.359 sec
    [junit] Running org.apache.commons.id.uuid.state.ReadOnlyResourceStateImplTest
    [junit] Tests run: 5, Failures: 0, Errors: 0, Time elapsed: 0.497 sec
    [junit] Running org.apache.commons.id.uuid.state.ReadWriteFileStateImplTest
    [junit] Tests run: 1, Failures: 0, Errors: 0, Time elapsed: 0.455 sec
    [junit] Running org.apache.commons.id.uuid.state.StateHelperTest
    [junit] Tests run: 6, Failures: 0, Errors: 0, Time elapsed: 0.329 sec
    [junit] Running org.apache.commons.id.uuid.state.InMemoryStateImplTest
    [junit] Tests run: 5, Failures: 1, Errors: 0, Time elapsed: 0.337 sec
    [junit] [ERROR] TEST org.apache.commons.id.uuid.state.InMemoryStateImplTest FAILED
    [junit] Running org.apache.commons.id.uuid.UUIDTest
    [junit] Tests run: 17, Failures: 0, Errors: 0, Time elapsed: 0.289 sec
    [junit] Running org.apache.commons.id.uuid.NodeManagerImplTest
    [junit] Tests run: 1, Failures: 0, Errors: 0, Time elapsed: 0.448 sec
    [junit] Running org.apache.commons.id.uuid.task.UUIDTaskTest
    [junit] Tests run: 5, Failures: 0, Errors: 0, Time elapsed: 0.573 sec
    [junit] Running org.apache.commons.id.uuid.clock.ThreadClockImplTest
    [junit] Tests run: 2, Failures: 0, Errors: 0, Time elapsed: 0.265 sec
    [junit] Running org.apache.commons.id.uuid.clock.SystemClockImplTest
    [junit] Tests run: 2, Failures: 0, Errors: 0, Time elapsed: 0.266 sec
    [junit] Running org.apache.commons.id.serial.AlphanumericGeneratorTest
    [junit] Tests run: 9, Failures: 0, Errors: 0, Time elapsed: 0.279 sec
    [junit] Running org.apache.commons.id.serial.LongGeneratorTest
    [junit] Tests run: 8, Failures: 0, Errors: 0, Time elapsed: 0.279 sec
    [junit] Running org.apache.commons.id.serial.PrefixedNumericGeneratorTest
    [junit] Tests run: 4, Failures: 0, Errors: 0, Time elapsed: 0.264 sec
    [junit] Running org.apache.commons.id.serial.NumericGeneratorTest
    [junit] Tests run: 8, Failures: 0, Errors: 0, Time elapsed: 0.276 sec
    [junit] Running org.apache.commons.id.serial.PrefixedLeftPaddedNumericGeneratorTest
    [junit] Tests run: 4, Failures: 0, Errors: 0, Time elapsed: 0.257 sec
    [junit] Running org.apache.commons.id.serial.PrefixedAlphanumericGeneratorTest
    [junit] Tests run: 4, Failures: 0, Errors: 0, Time elapsed: 0.26 sec
    [junit] Running org.apache.commons.id.serial.TimeBasedAlphanumericIdentifierGeneratorTest
    [junit] Tests run: 12, Failures: 0, Errors: 0, Time elapsed: 0.751 sec
    [junit] Running org.apache.commons.id.CompositeIdentifierGeneratorTest
    [junit] Tests run: 7, Failures: 0, Errors: 0, Time elapsed: 0.29 sec
    [junit] Running org.apache.commons.id.ConstantIdentifierGeneratorTest
    [junit] Tests run: 6, Failures: 0, Errors: 0, Time elapsed: 0.255 sec

BUILD FAILED
File...... /home/gump/.maven/cache/maven-test-plugin-1.6.2/plugin.jelly
Element... fail
Line...... 181
Column.... 54
There were test failures.
Total time: 45 seconds
Finished at: Sun Mar 18 06:43:05 UTC 2012

---------------------------------------------

To subscribe to this information via syndicated feeds:
- RSS: http://vmgump.apache.org/gump/public/commons-sandbox/commons-id/rss.xml
- Atom: http://vmgump.apache.org/gump/public/commons-sandbox/commons-id/atom.xml

============================== Gump Tracking Only ===
Produced by Apache Gump(TM) version 2.3.
Gump Run 12000018032012, vmgump.apache.org:vmgump:12000018032012
Gump E-mail Identifier (unique within run) #41.

--
Apache Gump
http://gump.apache.org/ [Instance: vmgump]

---------------------------------------------------------------------
To unsubscribe, e-mail: dev-unsubscribe@commons.apache.org
For additional commands, e-mail: dev-help@commons.apache.org


Mime
View raw message