commons-dev mailing list archives

Site index · List index
Message view « Date » · « Thread »
Top « Date » · « Thread »
From Gilles Sadowski <gil...@harfang.homelinux.org>
Subject Re: [continuum] BUILD FAILURE: Apache Commons - Commons Math - Default Maven 2 Build Definition (Java 1.5)
Date Wed, 22 Feb 2012 13:56:59 GMT
Hi.

This failure (unrelated to the latest commit) happens once in while...

> 
> ****************************************************************************
> Test Failures:
> ****************************************************************************
> 
> ValueServerTest
>     testNextDigest :
>   java.lang.AssertionError
>   java.lang.AssertionError: mean expected:<5.069831575018909> but was:<5.1759015765146605>
> 	at org.junit.Assert.fail(Assert.java:91)
> 	at org.junit.Assert.failNotEquals(Assert.java:645)
> 	at org.junit.Assert.assertEquals(Assert.java:441)
> 	at org.apache.commons.math3.random.ValueServerTest.testNextDigest(ValueServerTest.java:76)
> 	at sun.reflect.NativeMethodAccessorImpl.invoke0(Native Method)
> 	at sun.reflect.NativeMethodAccessorImpl.invoke(NativeMethodAccessorImpl.java:39)
> 	at sun.reflect.DelegatingMethodAccessorImpl.invoke(DelegatingMethodAccessorImpl.java:25)
> 	at java.lang.reflect.Method.invoke(Method.java:592)
> 	at org.junit.runners.model.FrameworkMethod$1.runReflectiveCall(FrameworkMethod.java:44)
> 	at org.junit.internal.runners.model.ReflectiveCallable.run(ReflectiveCallable.java:15)
> 	at org.junit.runners.model.FrameworkMethod.invokeExplosively(FrameworkMethod.java:41)
> 	at org.junit.internal.runners.statements.InvokeMethod.evaluate(InvokeMethod.java:20)
> 	at org.apache.commons.math3.RetryRunner$1.evaluate(RetryRunner.java:60)
> 	at org.junit.internal.runners.statements.RunBefores.evaluate(RunBefores.java:28)
> 	at org.junit.runners.BlockJUnit4ClassRunner.runNotIgnored(BlockJUnit4ClassRunner.java:79)
> 	at org.junit.runners.BlockJUnit4ClassRunner.runChild(BlockJUnit4ClassRunner.java:71)
> 	at org.junit.runners.BlockJUnit4ClassRunner.runChild(BlockJUnit4ClassRunner.java:49)
> 	at org.junit.runners.ParentRunner$3.run(ParentRunner.java:193)
> 	at org.junit.runners.ParentRunner$1.schedule(ParentRunner.java:52)
> 	at org.junit.runners.ParentRunner.runChildren(ParentRunner.java:191)
> 	at org.junit.runners.ParentRunner.access$000(ParentRunner.java:42)
> 	at org.junit.runners.ParentRunner$2.evaluate(ParentRunner.java:184)
> 	at org.junit.runners.ParentRunner.run(ParentRunner.java:236)
> 	at org.apache.maven.surefire.junit4.JUnit4TestSet.execute(JUnit4TestSet.java:35)
> 	at org.apache.maven.surefire.junit4.JUnit4Provider.executeTestSet(JUnit4Provider.java:115)
> 	at org.apache.maven.surefire.junit4.JUnit4Provider.invoke(JUnit4Provider.java:97)
> 	at sun.reflect.NativeMethodAccessorImpl.invoke0(Native Method)
> 	at sun.reflect.NativeMethodAccessorImpl.invoke(NativeMethodAccessorImpl.java:39)
> 	at sun.reflect.DelegatingMethodAccessorImpl.invoke(DelegatingMethodAccessorImpl.java:25)
> 	at java.lang.reflect.Method.invoke(Method.java:592)
> 	at org.apache.maven.surefire.booter.ProviderFactory$ClassLoaderProxy.invoke(ProviderFactory.java:103)
> 	at $Proxy0.invoke(Unknown Source)
> 	at org.apache.maven.surefire.booter.SurefireStarter.invokeProvider(SurefireStarter.java:150)
> 	at org.apache.maven.surefire.booter.SurefireStarter.runSuitesInProcess(SurefireStarter.java:91)
> 	at org.apache.maven.surefire.booter.ForkedBooter.main(ForkedBooter.java:69)
> 

---------------------------------------------------------------------
To unsubscribe, e-mail: dev-unsubscribe@commons.apache.org
For additional commands, e-mail: dev-help@commons.apache.org


Mime
View raw message