commons-dev mailing list archives

Site index · List index
Message view « Date » · « Thread »
Top « Date » · « Thread »
From Gump <iss...@commons.apache.org>
Subject [GUMP@vmgump]: Project commons-sanselan-test (in module apache-commons) failed
Date Sun, 08 Jan 2012 02:19:50 GMT
To whom it may engage...
        
This is an automated request, but not an unsolicited one. For 
more information please visit http://gump.apache.org/nagged.html, 
and/or contact the folk at general@gump.apache.org.

Project commons-sanselan-test has an issue affecting its community integration.
This issue affects 1 projects,
 and has been outstanding for 37 runs.
The current state of this project is 'Failed', with reason 'Build Failed'.
For reference only, the following projects are affected by this:
    - commons-sanselan-test :  Apache Commons


Full details are available at:
    http://vmgump.apache.org/gump/public/apache-commons/commons-sanselan-test/index.html

That said, some information snippets are provided here.

The following annotations (debug/informational/warning/error messages) were provided:
 -WARNING- Overriding Maven settings: [/srv/gump/public/workspace/apache-commons/sanselan/gump_mvn_settings.xml]
 -DEBUG- (Apache Gump generated) Apache Maven Settings in: /srv/gump/public/workspace/apache-commons/sanselan/gump_mvn_settings.xml
 -INFO- Failed with reason build failed
 -DEBUG- Maven POM in: /srv/gump/public/workspace/apache-commons/sanselan/pom.xml
 -INFO- Project Reports in: /srv/gump/public/workspace/apache-commons/sanselan/target/surefire-reports



The following work was performed:
http://vmgump.apache.org/gump/public/apache-commons/commons-sanselan-test/gump_work/build_apache-commons_commons-sanselan-test.html
Work Name: build_apache-commons_commons-sanselan-test (Type: Build)
Work ended in a state of : Failed
Elapsed: 2 mins 28 secs
Command Line: /opt/maven2/bin/mvn --batch-mode --settings /srv/gump/public/workspace/apache-commons/sanselan/gump_mvn_settings.xml
test 
[Working Directory: /srv/gump/public/workspace/apache-commons/sanselan]
M2_HOME: /opt/maven2
---------------------------------------------
Running org.apache.commons.sanselan.formats.jpeg.exif.TextFieldTest
Tests run: 2, Failures: 0, Errors: 0, Skipped: 0, Time elapsed: 2.557 sec
Running org.apache.commons.sanselan.formats.jpeg.exif.WriteExifMetadataExampleTest
Tests run: 2, Failures: 0, Errors: 0, Skipped: 0, Time elapsed: 3.916 sec
Running org.apache.commons.sanselan.formats.jpeg.exif.ExifRewriteTest
Tests run: 4, Failures: 0, Errors: 0, Skipped: 0, Time elapsed: 7.372 sec
Running org.apache.commons.sanselan.formats.jpeg.exif.MakerNoteFieldTest
Tests run: 2, Failures: 0, Errors: 0, Skipped: 0, Time elapsed: 2.524 sec
Running org.apache.commons.sanselan.formats.jpeg.exif.AsciiFieldTest
Tests run: 1, Failures: 0, Errors: 0, Skipped: 0, Time elapsed: 1.078 sec
Running org.apache.commons.sanselan.formats.jpeg.exif.ExifDumpTest
Tests run: 1, Failures: 0, Errors: 0, Skipped: 0, Time elapsed: 1.476 sec
Running org.apache.commons.sanselan.formats.jpeg.exif.WriteTagsTest
Tests run: 2, Failures: 0, Errors: 0, Skipped: 0, Time elapsed: 0.002 sec
Running org.apache.commons.sanselan.formats.jpeg.exif.GpsTest
Tests run: 1, Failures: 0, Errors: 0, Skipped: 0, Time elapsed: 1.434 sec
Running org.apache.commons.sanselan.formats.jpeg.iptc.IptcDumpTest
Tests run: 1, Failures: 0, Errors: 0, Skipped: 0, Time elapsed: 1.453 sec
Running org.apache.commons.sanselan.formats.jpeg.iptc.IptcUpdateTest
Tests run: 3, Failures: 0, Errors: 0, Skipped: 0, Time elapsed: 5.658 sec
Running org.apache.commons.sanselan.common.BinaryFileFunctionsTest
Tests run: 2, Failures: 0, Errors: 0, Skipped: 0, Time elapsed: 0.021 sec
Running org.apache.commons.sanselan.common.RationalNumberTest
Tests run: 1, Failures: 0, Errors: 0, Skipped: 0, Time elapsed: 0.008 sec
Running org.apache.commons.sanselan.common.bytesource.ByteSourceImageTest
Tests run: 1, Failures: 0, Errors: 0, Skipped: 0, Time elapsed: 17.533 sec
Running org.apache.commons.sanselan.common.bytesource.ByteSourceDataTest
Tests run: 1, Failures: 0, Errors: 0, Skipped: 0, Time elapsed: 0.083 sec
Running org.apache.commons.sanselan.color.ColorConversionsTest
Tests run: 5, Failures: 1, Errors: 0, Skipped: 0, Time elapsed: 0.035 sec <<< FAILURE!

Results :

Failed tests:   testCMYKtoRGB(org.apache.commons.sanselan.color.ColorConversionsTest): {C:
0.0, M: 0.0, Y: 64.0, K: 64.0} expected:<FFBFBF[8]F> but was:<FFBFBF[7]F>

Tests run: 86, Failures: 1, Errors: 0, Skipped: 0

[INFO] ------------------------------------------------------------------------
[ERROR] BUILD FAILURE
[INFO] ------------------------------------------------------------------------
[INFO] There are test failures.

Please refer to /srv/gump/public/workspace/apache-commons/sanselan/target/surefire-reports
for the individual test results.
[INFO] ------------------------------------------------------------------------
[INFO] For more information, run Maven with the -e switch
[INFO] ------------------------------------------------------------------------
[INFO] Total time: 2 minutes 26 seconds
[INFO] Finished at: Sun Jan 08 02:19:48 UTC 2012
[INFO] Final Memory: 34M/83M
[INFO] ------------------------------------------------------------------------
---------------------------------------------

To subscribe to this information via syndicated feeds:
- RSS: http://vmgump.apache.org/gump/public/apache-commons/commons-sanselan-test/rss.xml
- Atom: http://vmgump.apache.org/gump/public/apache-commons/commons-sanselan-test/atom.xml

============================== Gump Tracking Only ===
Produced by Apache Gump(TM) version 2.3.
Gump Run 11000008012012, vmgump.apache.org:vmgump:11000008012012
Gump E-mail Identifier (unique within run) #20.

--
Apache Gump
http://gump.apache.org/ [Instance: vmgump]

---------------------------------------------------------------------
To unsubscribe, e-mail: dev-unsubscribe@commons.apache.org
For additional commands, e-mail: dev-help@commons.apache.org


Mime
View raw message