commons-dev mailing list archives

Site index · List index
Message view « Date » · « Thread »
Top « Date » · « Thread »
From Gump <iss...@commons.apache.org>
Subject [GUMP@vmgump]: Project commons-digester3-test (in module apache-commons) failed
Date Sun, 04 Dec 2011 03:11:30 GMT
To whom it may engage...
        
This is an automated request, but not an unsolicited one. For 
more information please visit http://gump.apache.org/nagged.html, 
and/or contact the folk at general@gump.apache.org.

Project commons-digester3-test has an issue affecting its community integration.
This issue affects 1 projects,
 and has been outstanding for 78 runs.
The current state of this project is 'Failed', with reason 'Build Failed'.
For reference only, the following projects are affected by this:
    - commons-digester3-test :  Apache Commons


Full details are available at:
    http://vmgump.apache.org/gump/public/apache-commons/commons-digester3-test/index.html

That said, some information snippets are provided here.

The following annotations (debug/informational/warning/error messages) were provided:
 -WARNING- Overriding Maven settings: [/srv/gump/public/workspace/apache-commons/digester/gump_mvn_settings.xml]
 -DEBUG- (Apache Gump generated) Apache Maven Settings in: /srv/gump/public/workspace/apache-commons/digester/gump_mvn_settings.xml
 -INFO- Failed with reason build failed
 -DEBUG- Maven POM in: /srv/gump/public/workspace/apache-commons/digester/pom.xml
 -INFO- Project Reports in: /srv/gump/public/workspace/apache-commons/digester/target/surefire-reports



The following work was performed:
http://vmgump.apache.org/gump/public/apache-commons/commons-digester3-test/gump_work/build_apache-commons_commons-digester3-test.html
Work Name: build_apache-commons_commons-digester3-test (Type: Build)
Work ended in a state of : Failed
Elapsed: 21 secs
Command Line: /opt/maven2/bin/mvn --batch-mode --settings /srv/gump/public/workspace/apache-commons/digester/gump_mvn_settings.xml
test 
[Working Directory: /srv/gump/public/workspace/apache-commons/digester]
M2_HOME: /opt/maven2
---------------------------------------------
Running org.apache.commons.digester3.RulesBaseTestCase
Tests run: 5, Failures: 0, Errors: 0, Skipped: 0, Time elapsed: 0.005 sec
Running org.apache.commons.digester3.plugins.TestConfigurablePluginAttributes
Tests run: 3, Failures: 0, Errors: 0, Skipped: 0, Time elapsed: 0.046 sec
Running org.apache.commons.digester3.plugins.TestDelegate
Tests run: 1, Failures: 0, Errors: 0, Skipped: 0, Time elapsed: 0.001 sec
Running org.apache.commons.digester3.plugins.TestInline
Tests run: 2, Failures: 0, Errors: 0, Skipped: 0, Time elapsed: 0.03 sec
Running org.apache.commons.digester3.plugins.TestDefaultPlugin
Tests run: 1, Failures: 0, Errors: 0, Skipped: 0, Time elapsed: 0.017 sec
Running org.apache.commons.digester3.plugins.TestLocalRules
Tests run: 2, Failures: 0, Errors: 0, Skipped: 0, Time elapsed: 0.023 sec
Running org.apache.commons.digester3.plugins.TestXmlRuleInfo
Tests run: 3, Failures: 3, Errors: 0, Skipped: 0, Time elapsed: 0.069 sec <<< FAILURE!
Running org.apache.commons.digester3.plugins.TestRuleInfo
Tests run: 3, Failures: 0, Errors: 0, Skipped: 0, Time elapsed: 0.041 sec
Running org.apache.commons.digester3.plugins.TestRecursion
Tests run: 1, Failures: 0, Errors: 0, Skipped: 0, Time elapsed: 0.025 sec
Running org.apache.commons.digester3.plugins.TestDeclaration
Tests run: 1, Failures: 0, Errors: 0, Skipped: 0, Time elapsed: 0.019 sec
Running org.apache.commons.digester3.CallMethodRuleTestCase
Tests run: 15, Failures: 0, Errors: 0, Skipped: 0, Time elapsed: 0.249 sec
Running org.apache.commons.digester3.URLTestCase
Tests run: 2, Failures: 0, Errors: 0, Skipped: 0, Time elapsed: 0.034 sec
Running org.apache.commons.digester3.ObjectParamRuleTestCase
Tests run: 1, Failures: 0, Errors: 0, Skipped: 0, Time elapsed: 0.014 sec
Running org.apache.commons.digester3.TestFactoryCreate
Tests run: 4, Failures: 0, Errors: 0, Skipped: 0, Time elapsed: 0.088 sec

Results :

Failed tests:   testXmlRuleInfoExplicitFile(org.apache.commons.digester3.plugins.TestXmlRuleInfo):
expected:<xmlrules1> but was:<null>
  testXmlRuleInfoExplicitResource(org.apache.commons.digester3.plugins.TestXmlRuleInfo): expected:<xmlrules2>
but was:<null>
  testXmlRuleImplicitResource(org.apache.commons.digester3.plugins.TestXmlRuleInfo): expected:<xmlrules-ruleinfo>
but was:<null>

Tests run: 196, Failures: 3, Errors: 0, Skipped: 0

[INFO] ------------------------------------------------------------------------
[ERROR] BUILD FAILURE
[INFO] ------------------------------------------------------------------------
[INFO] There are test failures.

Please refer to /srv/gump/public/workspace/apache-commons/digester/target/surefire-reports
for the individual test results.
[INFO] ------------------------------------------------------------------------
[INFO] For more information, run Maven with the -e switch
[INFO] ------------------------------------------------------------------------
[INFO] Total time: 20 seconds
[INFO] Finished at: Sun Dec 04 03:11:28 UTC 2011
[INFO] Final Memory: 37M/89M
[INFO] ------------------------------------------------------------------------
---------------------------------------------

To subscribe to this information via syndicated feeds:
- RSS: http://vmgump.apache.org/gump/public/apache-commons/commons-digester3-test/rss.xml
- Atom: http://vmgump.apache.org/gump/public/apache-commons/commons-digester3-test/atom.xml

============================== Gump Tracking Only ===
Produced by Apache Gump(TM) version 2.3.
Gump Run 12000004122011, vmgump.apache.org:vmgump:12000004122011
Gump E-mail Identifier (unique within run) #24.

--
Apache Gump
http://gump.apache.org/ [Instance: vmgump]

---------------------------------------------------------------------
To unsubscribe, e-mail: dev-unsubscribe@commons.apache.org
For additional commands, e-mail: dev-help@commons.apache.org


Mime
View raw message