commons-dev mailing list archives

Site index · List index
Message view « Date » · « Thread »
Top « Date » · « Thread »
From "Continuum@vmbuild" <contin...@apache.org>
Subject [continuum] BUILD FAILURE: Apache Commons - Commons Math - Default Maven 2 Build Definition (Java 1.5)
Date Mon, 05 Dec 2011 08:29:32 GMT
Online report : http://vmbuild.apache.org/continuum/buildResult.action?buildId=15402&projectId=97

Build statistics:
  State: Failed
  Previous State: Ok
  Started at: Mon 5 Dec 2011 08:24:38 +0000
  Finished at: Mon 5 Dec 2011 08:28:46 +0000
  Total time: 4m 7s
  Build Trigger: Schedule
  Build Number: 607
  Exit code: 1
  Building machine hostname: vmbuild
  Operating system : Linux(unknown)
  Java Home version : 
          java version "1.6.0_26"
          Java(TM) SE Runtime Environment (build 1.6.0_26-b03)
          Java HotSpot(TM) 64-Bit Server VM (build 20.1-b02, mixed mode)
        
  Builder version :
          Apache Maven 2.2.1 (r801777; 2009-08-06 19:16:01+0000)
          Java version: 1.6.0_26
          Java home: /usr/lib/jvm/java-6-sun-1.6.0.26/jre
          Default locale: en_US, platform encoding: UTF-8
          OS name: "linux" version: "2.6.32-31-server" arch: "amd64" Family: "unix"
    
****************************************************************************
SCM Changes:
****************************************************************************
Changed: celestin @ Mon 5 Dec 2011 08:15:38 +0000
Comment: - Corrected expressions for mean and variance in distribution.PascalDistribution
(MATH-715).
- Made javadoc more explicit
- Restored SVN properties to various files in package distribution.
Files changed:
  /commons/proper/math/trunk/src/main/java/org/apache/commons/math/distribution/AbstractRealDistribution.java
( 1210359 )
  /commons/proper/math/trunk/src/main/java/org/apache/commons/math/distribution/BetaDistribution.java
( 1210359 )
  /commons/proper/math/trunk/src/main/java/org/apache/commons/math/distribution/BinomialDistribution.java
( 1210359 )
  /commons/proper/math/trunk/src/main/java/org/apache/commons/math/distribution/CauchyDistribution.java
( 1210359 )
  /commons/proper/math/trunk/src/main/java/org/apache/commons/math/distribution/ChiSquaredDistribution.java
( 1210359 )
  /commons/proper/math/trunk/src/main/java/org/apache/commons/math/distribution/ExponentialDistribution.java
( 1210359 )
  /commons/proper/math/trunk/src/main/java/org/apache/commons/math/distribution/FDistribution.java
( 1210359 )
  /commons/proper/math/trunk/src/main/java/org/apache/commons/math/distribution/GammaDistribution.java
( 1210359 )
  /commons/proper/math/trunk/src/main/java/org/apache/commons/math/distribution/HypergeometricDistribution.java
( 1210359 )
  /commons/proper/math/trunk/src/main/java/org/apache/commons/math/distribution/KolmogorovSmirnovDistribution.java
( 1210359 )
  /commons/proper/math/trunk/src/main/java/org/apache/commons/math/distribution/NormalDistribution.java
( 1210359 )
  /commons/proper/math/trunk/src/main/java/org/apache/commons/math/distribution/PascalDistribution.java
( 1210359 )
  /commons/proper/math/trunk/src/main/java/org/apache/commons/math/distribution/PoissonDistribution.java
( 1210359 )
  /commons/proper/math/trunk/src/main/java/org/apache/commons/math/distribution/SaddlePointExpansion.java
( 1210359 )
  /commons/proper/math/trunk/src/main/java/org/apache/commons/math/distribution/TDistribution.java
( 1210359 )
  /commons/proper/math/trunk/src/main/java/org/apache/commons/math/distribution/WeibullDistribution.java
( 1210359 )
  /commons/proper/math/trunk/src/main/java/org/apache/commons/math/distribution/ZipfDistribution.java
( 1210359 )

****************************************************************************
Dependencies Changes:
****************************************************************************
No dependencies changed


****************************************************************************
Build Definition:
****************************************************************************
POM filename: pom.xml
Goals: clean deploy   
Arguments: --batch-mode -Pjava-1.5
Build Fresh: false
Always Build: false
Default Build Definition: true
Schedule: COMMONS_SCHEDULE
Profile Name: Maven 2.2.1
Description: Default Maven 2 Build Definition (Java 1.5)

****************************************************************************
Test Summary:
****************************************************************************
Tests: 3164
Failures: 1
Errors: 0
Success Rate: 99
Total time: 141.78304

****************************************************************************
Test Failures:
****************************************************************************

PascalDistributionTest
    testMoments :
  java.lang.AssertionError
  java.lang.AssertionError: expected:<58.333333333333336> but was:<10.714285714285715>
	at org.junit.Assert.fail(Assert.java:91)
	at org.junit.Assert.failNotEquals(Assert.java:645)
	at org.junit.Assert.assertEquals(Assert.java:441)
	at org.junit.Assert.assertEquals(Assert.java:510)
	at org.apache.commons.math.distribution.PascalDistributionTest.testMoments(PascalDistributionTest.java:130)
	at sun.reflect.NativeMethodAccessorImpl.invoke0(Native Method)
	at sun.reflect.NativeMethodAccessorImpl.invoke(NativeMethodAccessorImpl.java:39)
	at sun.reflect.DelegatingMethodAccessorImpl.invoke(DelegatingMethodAccessorImpl.java:25)
	at java.lang.reflect.Method.invoke(Method.java:592)
	at org.junit.runners.model.FrameworkMethod$1.runReflectiveCall(FrameworkMethod.java:44)
	at org.junit.internal.runners.model.ReflectiveCallable.run(ReflectiveCallable.java:15)
	at org.junit.runners.model.FrameworkMethod.invokeExplosively(FrameworkMethod.java:41)
	at org.junit.internal.runners.statements.InvokeMethod.evaluate(InvokeMethod.java:20)
	at org.junit.internal.runners.statements.RunBefores.evaluate(RunBefores.java:28)
	at org.junit.internal.runners.statements.RunAfters.evaluate(RunAfters.java:31)
	at org.junit.runners.BlockJUnit4ClassRunner.runNotIgnored(BlockJUnit4ClassRunner.java:79)
	at org.junit.runners.BlockJUnit4ClassRunner.runChild(BlockJUnit4ClassRunner.java:71)
	at org.junit.runners.BlockJUnit4ClassRunner.runChild(BlockJUnit4ClassRunner.java:49)
	at org.junit.runners.ParentRunner$3.run(ParentRunner.java:193)
	at org.junit.runners.ParentRunner$1.schedule(ParentRunner.java:52)
	at org.junit.runners.ParentRunner.runChildren(ParentRunner.java:191)
	at org.junit.runners.ParentRunner.access$000(ParentRunner.java:42)
	at org.junit.runners.ParentRunner$2.evaluate(ParentRunner.java:184)
	at org.junit.runners.ParentRunner.run(ParentRunner.java:236)
	at org.apache.maven.surefire.junit4.JUnit4TestSet.execute(JUnit4TestSet.java:35)
	at org.apache.maven.surefire.junit4.JUnit4Provider.executeTestSet(JUnit4Provider.java:115)
	at org.apache.maven.surefire.junit4.JUnit4Provider.invoke(JUnit4Provider.java:97)
	at sun.reflect.NativeMethodAccessorImpl.invoke0(Native Method)
	at sun.reflect.NativeMethodAccessorImpl.invoke(NativeMethodAccessorImpl.java:39)
	at sun.reflect.DelegatingMethodAccessorImpl.invoke(DelegatingMethodAccessorImpl.java:25)
	at java.lang.reflect.Method.invoke(Method.java:592)
	at org.apache.maven.surefire.booter.ProviderFactory$ClassLoaderProxy.invoke(ProviderFactory.java:103)
	at $Proxy0.invoke(Unknown Source)
	at org.apache.maven.surefire.booter.SurefireStarter.invokeProvider(SurefireStarter.java:150)
	at org.apache.maven.surefire.booter.SurefireStarter.runSuitesInProcess(SurefireStarter.java:91)
	at org.apache.maven.surefire.booter.ForkedBooter.main(ForkedBooter.java:69)


  



---------------------------------------------------------------------
To unsubscribe, e-mail: dev-unsubscribe@commons.apache.org
For additional commands, e-mail: dev-help@commons.apache.org


Mime
View raw message