commons-dev mailing list archives

Site index · List index
Message view « Date » · « Thread »
Top « Date » · « Thread »
From Jörg Schaible <joerg.schai...@gmx.de>
Subject Re: [VOTE] Release Commons Lang 3.1 (Based on RC1)
Date Thu, 10 Nov 2011 21:44:15 GMT
Hi Hen,

Henri Yandell wrote:

> Post the abortive 3.0.2 vote, a first pass at 3.1. I rolled back the
> comparators to be
> considered/argued about for 3.2.
> 
> RC1 is available here:
> 
>  http://people.apache.org/~bayard/commons-lang-3.1-RC1/
> 
> SVN:
> 
>  http://svn.apache.org/repos/asf/commons/proper/lang/tags/LANG_3_1_RC1/
> 
> Website:
> 
>  http://people.apache.org/~bayard/commons-lang-3.1-RC1/site/
> 
> This vote will close no sooner than in 72 hours time, 0800 GMT 13
> November 2011.
> 
> ================
>  [ ] +1
>  [ ] -1, with reason
> ================

Fails here for latest Oracle JDK 1.7.0_1:
========================== %< ====================
$ java -version
java version "1.7.0_01"
Java(TM) SE Runtime Environment (build 1.7.0_01-b08)
Java HotSpot(TM) 64-Bit Server VM (build 21.1-b02, mixed mode)
========================== %< ====================
Failed tests:   
testReflectionArrayCycle(org.apache.commons.lang3.builder.ToStringBuilderTest)
  testReflectionArrayCycleLevel2(org.apache.commons.lang3.builder.ToStringBuilderTest)
  testReflectionArrayArrayCycle(org.apache.commons.lang3.builder.ToStringBuilderTest)
  testSimpleReflectionObjectCycle(org.apache.commons.lang3.builder.ToStringBuilderTest)
  testSelfInstanceVarReflectionObjectCycle(org.apache.commons.lang3.builder.ToStringBuilderTest)
  testSelfInstanceTwoVarsReflectionObjectCycle(org.apache.commons.lang3.builder.ToStringBuilderTest)
  testReflectionArrayAndObjectCycle(org.apache.commons.lang3.builder.ToStringBuilderTest)
========================== %< ====================
-------------------------------------------------------------------------------
Test set: org.apache.commons.lang3.builder.ToStringBuilderTest
-------------------------------------------------------------------------------
Tests run: 74, Failures: 7, Errors: 0, Skipped: 0, Time elapsed: 0.097 sec 
<<< FAILURE!
testReflectionArrayCycle(org.apache.commons.lang3.builder.ToStringBuilderTest)  
Time elapsed: 0.005 sec  <<< FAILURE!
java.lang.AssertionError
	at org.junit.Assert.fail(Assert.java:92)
	at org.junit.Assert.assertTrue(Assert.java:43)
	at org.junit.Assert.assertNull(Assert.java:551)
	at org.junit.Assert.assertNull(Assert.java:562)
	at 
org.apache.commons.lang3.builder.ToStringBuilderTest.validateNullToStringStyleRegistry(ToStringBuilderTest.java:632)
	at 
org.apache.commons.lang3.builder.ToStringBuilderTest.testReflectionArrayCycle(ToStringBuilderTest.java:421)
	at sun.reflect.NativeMethodAccessorImpl.invoke0(Native Method)
	at 
sun.reflect.NativeMethodAccessorImpl.invoke(NativeMethodAccessorImpl.java:57)
	at 
sun.reflect.DelegatingMethodAccessorImpl.invoke(DelegatingMethodAccessorImpl.java:43)
	at java.lang.reflect.Method.invoke(Method.java:601)
	at 
org.junit.runners.model.FrameworkMethod$1.runReflectiveCall(FrameworkMethod.java:45)
	at 
org.junit.internal.runners.model.ReflectiveCallable.run(ReflectiveCallable.java:15)
	at 
org.junit.runners.model.FrameworkMethod.invokeExplosively(FrameworkMethod.java:42)
	at 
org.junit.internal.runners.statements.InvokeMethod.evaluate(InvokeMethod.java:20)
	at 
org.junit.runners.ParentRunner.runLeaf(ParentRunner.java:263)
	at 
org.junit.runners.BlockJUnit4ClassRunner.runChild(BlockJUnit4ClassRunner.java:68)
	at 
org.junit.runners.BlockJUnit4ClassRunner.runChild(BlockJUnit4ClassRunner.java:47)
	at org.junit.runners.ParentRunner$3.run(ParentRunner.java:231)
	at 
org.junit.runners.ParentRunner$1.schedule(ParentRunner.java:60)
	at 
org.junit.runners.ParentRunner.runChildren(ParentRunner.java:229)
	at 
org.junit.runners.ParentRunner.access$000(ParentRunner.java:50)
	at 
org.junit.runners.ParentRunner$2.evaluate(ParentRunner.java:222)
	at org.junit.runners.ParentRunner.run(ParentRunner.java:300)
	at 
org.apache.maven.surefire.junit4.JUnit4TestSet.execute(JUnit4TestSet.java:53)
	at 
org.apache.maven.surefire.junit4.JUnit4Provider.executeTestSet(JUnit4Provider.java:123)
	at 
org.apache.maven.surefire.junit4.JUnit4Provider.invoke(JUnit4Provider.java:104)
	at sun.reflect.NativeMethodAccessorImpl.invoke0(Native Method)
	at 
sun.reflect.NativeMethodAccessorImpl.invoke(NativeMethodAccessorImpl.java:57)
	at 
sun.reflect.DelegatingMethodAccessorImpl.invoke(DelegatingMethodAccessorImpl.java:43)
	at java.lang.reflect.Method.invoke(Method.java:601)
	at 
org.apache.maven.surefire.util.ReflectionUtils.invokeMethodWithArray(ReflectionUtils.java:164)
	at 
org.apache.maven.surefire.booter.ProviderFactory$ProviderProxy.invoke(ProviderFactory.java:110)
	at 
org.apache.maven.surefire.booter.SurefireStarter.invokeProvider(SurefireStarter.java:172)
	at 
org.apache.maven.surefire.booter.SurefireStarter.runSuitesInProcessWhenForked(SurefireStarter.java:104)
	at 
org.apache.maven.surefire.booter.ForkedBooter.main(ForkedBooter.java:70)
testReflectionArrayCycleLevel2(org.apache.commons.lang3.builder.ToStringBuilderTest)  
Time elapsed: 0 sec  <<< FAILURE!
java.lang.AssertionError
	at org.junit.Assert.fail(Assert.java:92)
	at org.junit.Assert.assertTrue(Assert.java:43)
	at org.junit.Assert.assertNull(Assert.java:551)
	at org.junit.Assert.assertNull(Assert.java:562)
	at 
org.apache.commons.lang3.builder.ToStringBuilderTest.validateNullToStringStyleRegistry(ToStringBuilderTest.java:632)
	at 
org.apache.commons.lang3.builder.ToStringBuilderTest.testReflectionArrayCycleLevel2(ToStringBuilderTest.java:439)
	at sun.reflect.NativeMethodAccessorImpl.invoke0(Native Method)
	at 
sun.reflect.NativeMethodAccessorImpl.invoke(NativeMethodAccessorImpl.java:57)
	at 
sun.reflect.DelegatingMethodAccessorImpl.invoke(DelegatingMethodAccessorImpl.java:43)
	at java.lang.reflect.Method.invoke(Method.java:601)
	at 
org.junit.runners.model.FrameworkMethod$1.runReflectiveCall(FrameworkMethod.java:45)
	at 
org.junit.internal.runners.model.ReflectiveCallable.run(ReflectiveCallable.java:15)
	at 
org.junit.runners.model.FrameworkMethod.invokeExplosively(FrameworkMethod.java:42)
	at 
org.junit.internal.runners.statements.InvokeMethod.evaluate(InvokeMethod.java:20)
	at 
org.junit.runners.ParentRunner.runLeaf(ParentRunner.java:263)
	at 
org.junit.runners.BlockJUnit4ClassRunner.runChild(BlockJUnit4ClassRunner.java:68)
	at 
org.junit.runners.BlockJUnit4ClassRunner.runChild(BlockJUnit4ClassRunner.java:47)
	at org.junit.runners.ParentRunner$3.run(ParentRunner.java:231)
	at 
org.junit.runners.ParentRunner$1.schedule(ParentRunner.java:60)
	at 
org.junit.runners.ParentRunner.runChildren(ParentRunner.java:229)
	at 
org.junit.runners.ParentRunner.access$000(ParentRunner.java:50)
	at 
org.junit.runners.ParentRunner$2.evaluate(ParentRunner.java:222)
	at org.junit.runners.ParentRunner.run(ParentRunner.java:300)
	at 
org.apache.maven.surefire.junit4.JUnit4TestSet.execute(JUnit4TestSet.java:53)
	at 
org.apache.maven.surefire.junit4.JUnit4Provider.executeTestSet(JUnit4Provider.java:123)
	at 
org.apache.maven.surefire.junit4.JUnit4Provider.invoke(JUnit4Provider.java:104)
	at sun.reflect.NativeMethodAccessorImpl.invoke0(Native Method)
	at 
sun.reflect.NativeMethodAccessorImpl.invoke(NativeMethodAccessorImpl.java:57)
	at 
sun.reflect.DelegatingMethodAccessorImpl.invoke(DelegatingMethodAccessorImpl.java:43)
	at java.lang.reflect.Method.invoke(Method.java:601)
	at 
org.apache.maven.surefire.util.ReflectionUtils.invokeMethodWithArray(ReflectionUtils.java:164)
	at 
org.apache.maven.surefire.booter.ProviderFactory$ProviderProxy.invoke(ProviderFactory.java:110)
	at 
org.apache.maven.surefire.booter.SurefireStarter.invokeProvider(SurefireStarter.java:172)
	at 
org.apache.maven.surefire.booter.SurefireStarter.runSuitesInProcessWhenForked(SurefireStarter.java:104)
	at 
org.apache.maven.surefire.booter.ForkedBooter.main(ForkedBooter.java:70)
testReflectionArrayArrayCycle(org.apache.commons.lang3.builder.ToStringBuilderTest)  
Time elapsed: 0.001 sec  <<< FAILURE!
java.lang.AssertionError
	at org.junit.Assert.fail(Assert.java:92)
	at org.junit.Assert.assertTrue(Assert.java:43)
	at org.junit.Assert.assertNull(Assert.java:551)
	at org.junit.Assert.assertNull(Assert.java:562)
	at 
org.apache.commons.lang3.builder.ToStringBuilderTest.validateNullToStringStyleRegistry(ToStringBuilderTest.java:632)
	at 
org.apache.commons.lang3.builder.ToStringBuilderTest.testReflectionArrayArrayCycle(ToStringBuilderTest.java:462)
	at sun.reflect.NativeMethodAccessorImpl.invoke0(Native Method)
	at 
sun.reflect.NativeMethodAccessorImpl.invoke(NativeMethodAccessorImpl.java:57)
	at 
sun.reflect.DelegatingMethodAccessorImpl.invoke(DelegatingMethodAccessorImpl.java:43)
	at java.lang.reflect.Method.invoke(Method.java:601)
	at 
org.junit.runners.model.FrameworkMethod$1.runReflectiveCall(FrameworkMethod.java:45)
	at 
org.junit.internal.runners.model.ReflectiveCallable.run(ReflectiveCallable.java:15)
	at 
org.junit.runners.model.FrameworkMethod.invokeExplosively(FrameworkMethod.java:42)
	at 
org.junit.internal.runners.statements.InvokeMethod.evaluate(InvokeMethod.java:20)
	at 
org.junit.runners.ParentRunner.runLeaf(ParentRunner.java:263)
	at 
org.junit.runners.BlockJUnit4ClassRunner.runChild(BlockJUnit4ClassRunner.java:68)
	at 
org.junit.runners.BlockJUnit4ClassRunner.runChild(BlockJUnit4ClassRunner.java:47)
	at org.junit.runners.ParentRunner$3.run(ParentRunner.java:231)
	at 
org.junit.runners.ParentRunner$1.schedule(ParentRunner.java:60)
	at 
org.junit.runners.ParentRunner.runChildren(ParentRunner.java:229)
	at 
org.junit.runners.ParentRunner.access$000(ParentRunner.java:50)
	at 
org.junit.runners.ParentRunner$2.evaluate(ParentRunner.java:222)
	at org.junit.runners.ParentRunner.run(ParentRunner.java:300)
	at 
org.apache.maven.surefire.junit4.JUnit4TestSet.execute(JUnit4TestSet.java:53)
	at 
org.apache.maven.surefire.junit4.JUnit4Provider.executeTestSet(JUnit4Provider.java:123)
	at 
org.apache.maven.surefire.junit4.JUnit4Provider.invoke(JUnit4Provider.java:104)
	at sun.reflect.NativeMethodAccessorImpl.invoke0(Native Method)
	at 
sun.reflect.NativeMethodAccessorImpl.invoke(NativeMethodAccessorImpl.java:57)
	at 
sun.reflect.DelegatingMethodAccessorImpl.invoke(DelegatingMethodAccessorImpl.java:43)
	at java.lang.reflect.Method.invoke(Method.java:601)
	at 
org.apache.maven.surefire.util.ReflectionUtils.invokeMethodWithArray(ReflectionUtils.java:164)
	at 
org.apache.maven.surefire.booter.ProviderFactory$ProviderProxy.invoke(ProviderFactory.java:110)
	at 
org.apache.maven.surefire.booter.SurefireStarter.invokeProvider(SurefireStarter.java:172)
	at 
org.apache.maven.surefire.booter.SurefireStarter.runSuitesInProcessWhenForked(SurefireStarter.java:104)
	at 
org.apache.maven.surefire.booter.ForkedBooter.main(ForkedBooter.java:70)
testSimpleReflectionObjectCycle(org.apache.commons.lang3.builder.ToStringBuilderTest)  
Time elapsed: 0.001 sec  <<< FAILURE!
java.lang.AssertionError
	at org.junit.Assert.fail(Assert.java:92)
	at org.junit.Assert.assertTrue(Assert.java:43)
	at org.junit.Assert.assertNull(Assert.java:551)
	at org.junit.Assert.assertNull(Assert.java:562)
	at 
org.apache.commons.lang3.builder.ToStringBuilderTest.validateNullToStringStyleRegistry(ToStringBuilderTest.java:632)
	at 
org.apache.commons.lang3.builder.ToStringBuilderTest.testSimpleReflectionObjectCycle(ToStringBuilderTest.java:552)
	at sun.reflect.NativeMethodAccessorImpl.invoke0(Native Method)
	at 
sun.reflect.NativeMethodAccessorImpl.invoke(NativeMethodAccessorImpl.java:57)
	at 
sun.reflect.DelegatingMethodAccessorImpl.invoke(DelegatingMethodAccessorImpl.java:43)
	at java.lang.reflect.Method.invoke(Method.java:601)
	at 
org.junit.runners.model.FrameworkMethod$1.runReflectiveCall(FrameworkMethod.java:45)
	at 
org.junit.internal.runners.model.ReflectiveCallable.run(ReflectiveCallable.java:15)
	at 
org.junit.runners.model.FrameworkMethod.invokeExplosively(FrameworkMethod.java:42)
	at 
org.junit.internal.runners.statements.InvokeMethod.evaluate(InvokeMethod.java:20)
	at 
org.junit.runners.ParentRunner.runLeaf(ParentRunner.java:263)
	at 
org.junit.runners.BlockJUnit4ClassRunner.runChild(BlockJUnit4ClassRunner.java:68)
	at 
org.junit.runners.BlockJUnit4ClassRunner.runChild(BlockJUnit4ClassRunner.java:47)
	at org.junit.runners.ParentRunner$3.run(ParentRunner.java:231)
	at 
org.junit.runners.ParentRunner$1.schedule(ParentRunner.java:60)
	at 
org.junit.runners.ParentRunner.runChildren(ParentRunner.java:229)
	at 
org.junit.runners.ParentRunner.access$000(ParentRunner.java:50)
	at 
org.junit.runners.ParentRunner$2.evaluate(ParentRunner.java:222)
	at org.junit.runners.ParentRunner.run(ParentRunner.java:300)
	at 
org.apache.maven.surefire.junit4.JUnit4TestSet.execute(JUnit4TestSet.java:53)
	at 
org.apache.maven.surefire.junit4.JUnit4Provider.executeTestSet(JUnit4Provider.java:123)
	at 
org.apache.maven.surefire.junit4.JUnit4Provider.invoke(JUnit4Provider.java:104)
	at sun.reflect.NativeMethodAccessorImpl.invoke0(Native Method)
	at 
sun.reflect.NativeMethodAccessorImpl.invoke(NativeMethodAccessorImpl.java:57)
	at 
sun.reflect.DelegatingMethodAccessorImpl.invoke(DelegatingMethodAccessorImpl.java:43)
	at java.lang.reflect.Method.invoke(Method.java:601)
	at 
org.apache.maven.surefire.util.ReflectionUtils.invokeMethodWithArray(ReflectionUtils.java:164)
	at 
org.apache.maven.surefire.booter.ProviderFactory$ProviderProxy.invoke(ProviderFactory.java:110)
	at 
org.apache.maven.surefire.booter.SurefireStarter.invokeProvider(SurefireStarter.java:172)
	at 
org.apache.maven.surefire.booter.SurefireStarter.runSuitesInProcessWhenForked(SurefireStarter.java:104)
	at 
org.apache.maven.surefire.booter.ForkedBooter.main(ForkedBooter.java:70)
testSelfInstanceVarReflectionObjectCycle(org.apache.commons.lang3.builder.ToStringBuilderTest)
 
Time elapsed: 0 sec  <<< FAILURE!
java.lang.AssertionError
	at org.junit.Assert.fail(Assert.java:92)
	at org.junit.Assert.assertTrue(Assert.java:43)
	at org.junit.Assert.assertNull(Assert.java:551)
	at org.junit.Assert.assertNull(Assert.java:562)
	at 
org.apache.commons.lang3.builder.ToStringBuilderTest.validateNullToStringStyleRegistry(ToStringBuilderTest.java:632)
	at 
org.apache.commons.lang3.builder.ToStringBuilderTest.testSelfInstanceVarReflectionObjectCycle(ToStringBuilderTest.java:564)
	at sun.reflect.NativeMethodAccessorImpl.invoke0(Native Method)
	at 
sun.reflect.NativeMethodAccessorImpl.invoke(NativeMethodAccessorImpl.java:57)
	at 
sun.reflect.DelegatingMethodAccessorImpl.invoke(DelegatingMethodAccessorImpl.java:43)
	at java.lang.reflect.Method.invoke(Method.java:601)
	at 
org.junit.runners.model.FrameworkMethod$1.runReflectiveCall(FrameworkMethod.java:45)
	at 
org.junit.internal.runners.model.ReflectiveCallable.run(ReflectiveCallable.java:15)
	at 
org.junit.runners.model.FrameworkMethod.invokeExplosively(FrameworkMethod.java:42)
	at 
org.junit.internal.runners.statements.InvokeMethod.evaluate(InvokeMethod.java:20)
	at 
org.junit.runners.ParentRunner.runLeaf(ParentRunner.java:263)
	at 
org.junit.runners.BlockJUnit4ClassRunner.runChild(BlockJUnit4ClassRunner.java:68)
	at 
org.junit.runners.BlockJUnit4ClassRunner.runChild(BlockJUnit4ClassRunner.java:47)
	at org.junit.runners.ParentRunner$3.run(ParentRunner.java:231)
	at 
org.junit.runners.ParentRunner$1.schedule(ParentRunner.java:60)
	at 
org.junit.runners.ParentRunner.runChildren(ParentRunner.java:229)
	at 
org.junit.runners.ParentRunner.access$000(ParentRunner.java:50)
	at 
org.junit.runners.ParentRunner$2.evaluate(ParentRunner.java:222)
	at org.junit.runners.ParentRunner.run(ParentRunner.java:300)
	at 
org.apache.maven.surefire.junit4.JUnit4TestSet.execute(JUnit4TestSet.java:53)
	at 
org.apache.maven.surefire.junit4.JUnit4Provider.executeTestSet(JUnit4Provider.java:123)
	at 
org.apache.maven.surefire.junit4.JUnit4Provider.invoke(JUnit4Provider.java:104)
	at sun.reflect.NativeMethodAccessorImpl.invoke0(Native Method)
	at 
sun.reflect.NativeMethodAccessorImpl.invoke(NativeMethodAccessorImpl.java:57)
	at 
sun.reflect.DelegatingMethodAccessorImpl.invoke(DelegatingMethodAccessorImpl.java:43)
	at java.lang.reflect.Method.invoke(Method.java:601)
	at 
org.apache.maven.surefire.util.ReflectionUtils.invokeMethodWithArray(ReflectionUtils.java:164)
	at 
org.apache.maven.surefire.booter.ProviderFactory$ProviderProxy.invoke(ProviderFactory.java:110)
	at 
org.apache.maven.surefire.booter.SurefireStarter.invokeProvider(SurefireStarter.java:172)
	at 
org.apache.maven.surefire.booter.SurefireStarter.runSuitesInProcessWhenForked(SurefireStarter.java:104)
	at 
org.apache.maven.surefire.booter.ForkedBooter.main(ForkedBooter.java:70)
testSelfInstanceTwoVarsReflectionObjectCycle(org.apache.commons.lang3.builder.ToStringBuilderTest)
 
Time elapsed: 0 sec  <<< FAILURE!
java.lang.AssertionError
	at org.junit.Assert.fail(Assert.java:92)
	at org.junit.Assert.assertTrue(Assert.java:43)
	at org.junit.Assert.assertNull(Assert.java:551)
	at org.junit.Assert.assertNull(Assert.java:562)
	at 
org.apache.commons.lang3.builder.ToStringBuilderTest.validateNullToStringStyleRegistry(ToStringBuilderTest.java:632)
	at 
org.apache.commons.lang3.builder.ToStringBuilderTest.testSelfInstanceTwoVarsReflectionObjectCycle(ToStringBuilderTest.java:577)
	at sun.reflect.NativeMethodAccessorImpl.invoke0(Native Method)
	at 
sun.reflect.NativeMethodAccessorImpl.invoke(NativeMethodAccessorImpl.java:57)
	at 
sun.reflect.DelegatingMethodAccessorImpl.invoke(DelegatingMethodAccessorImpl.java:43)
	at java.lang.reflect.Method.invoke(Method.java:601)
	at 
org.junit.runners.model.FrameworkMethod$1.runReflectiveCall(FrameworkMethod.java:45)
	at 
org.junit.internal.runners.model.ReflectiveCallable.run(ReflectiveCallable.java:15)
	at 
org.junit.runners.model.FrameworkMethod.invokeExplosively(FrameworkMethod.java:42)
	at 
org.junit.internal.runners.statements.InvokeMethod.evaluate(InvokeMethod.java:20)
	at 
org.junit.runners.ParentRunner.runLeaf(ParentRunner.java:263)
	at 
org.junit.runners.BlockJUnit4ClassRunner.runChild(BlockJUnit4ClassRunner.java:68)
	at 
org.junit.runners.BlockJUnit4ClassRunner.runChild(BlockJUnit4ClassRunner.java:47)
	at org.junit.runners.ParentRunner$3.run(ParentRunner.java:231)
	at 
org.junit.runners.ParentRunner$1.schedule(ParentRunner.java:60)
	at 
org.junit.runners.ParentRunner.runChildren(ParentRunner.java:229)
	at 
org.junit.runners.ParentRunner.access$000(ParentRunner.java:50)
	at 
org.junit.runners.ParentRunner$2.evaluate(ParentRunner.java:222)
	at org.junit.runners.ParentRunner.run(ParentRunner.java:300)
	at 
org.apache.maven.surefire.junit4.JUnit4TestSet.execute(JUnit4TestSet.java:53)
	at 
org.apache.maven.surefire.junit4.JUnit4Provider.executeTestSet(JUnit4Provider.java:123)
	at 
org.apache.maven.surefire.junit4.JUnit4Provider.invoke(JUnit4Provider.java:104)
	at sun.reflect.NativeMethodAccessorImpl.invoke0(Native Method)
	at 
sun.reflect.NativeMethodAccessorImpl.invoke(NativeMethodAccessorImpl.java:57)
	at 
sun.reflect.DelegatingMethodAccessorImpl.invoke(DelegatingMethodAccessorImpl.java:43)
	at java.lang.reflect.Method.invoke(Method.java:601)
	at 
org.apache.maven.surefire.util.ReflectionUtils.invokeMethodWithArray(ReflectionUtils.java:164)
	at 
org.apache.maven.surefire.booter.ProviderFactory$ProviderProxy.invoke(ProviderFactory.java:110)
	at 
org.apache.maven.surefire.booter.SurefireStarter.invokeProvider(SurefireStarter.java:172)
	at 
org.apache.maven.surefire.booter.SurefireStarter.runSuitesInProcessWhenForked(SurefireStarter.java:104)
	at 
org.apache.maven.surefire.booter.ForkedBooter.main(ForkedBooter.java:70)
testReflectionArrayAndObjectCycle(org.apache.commons.lang3.builder.ToStringBuilderTest)  
Time elapsed: 0.001 sec  <<< FAILURE!
java.lang.AssertionError
	at org.junit.Assert.fail(Assert.java:92)
	at org.junit.Assert.assertTrue(Assert.java:43)
	at org.junit.Assert.assertNull(Assert.java:551)
	at org.junit.Assert.assertNull(Assert.java:562)
	at 
org.apache.commons.lang3.builder.ToStringBuilderTest.validateNullToStringStyleRegistry(ToStringBuilderTest.java:632)
	at 
org.apache.commons.lang3.builder.ToStringBuilderTest.testReflectionArrayAndObjectCycle(ToStringBuilderTest.java:624)
	at sun.reflect.NativeMethodAccessorImpl.invoke0(Native Method)
	at 
sun.reflect.NativeMethodAccessorImpl.invoke(NativeMethodAccessorImpl.java:57)
	at 
sun.reflect.DelegatingMethodAccessorImpl.invoke(DelegatingMethodAccessorImpl.java:43)
	at java.lang.reflect.Method.invoke(Method.java:601)
	at 
org.junit.runners.model.FrameworkMethod$1.runReflectiveCall(FrameworkMethod.java:45)
	at 
org.junit.internal.runners.model.ReflectiveCallable.run(ReflectiveCallable.java:15)
	at 
org.junit.runners.model.FrameworkMethod.invokeExplosively(FrameworkMethod.java:42)
	at 
org.junit.internal.runners.statements.InvokeMethod.evaluate(InvokeMethod.java:20)
	at 
org.junit.runners.ParentRunner.runLeaf(ParentRunner.java:263)
	at 
org.junit.runners.BlockJUnit4ClassRunner.runChild(BlockJUnit4ClassRunner.java:68)
	at 
org.junit.runners.BlockJUnit4ClassRunner.runChild(BlockJUnit4ClassRunner.java:47)
	at org.junit.runners.ParentRunner$3.run(ParentRunner.java:231)
	at 
org.junit.runners.ParentRunner$1.schedule(ParentRunner.java:60)
	at 
org.junit.runners.ParentRunner.runChildren(ParentRunner.java:229)
	at 
org.junit.runners.ParentRunner.access$000(ParentRunner.java:50)
	at 
org.junit.runners.ParentRunner$2.evaluate(ParentRunner.java:222)
	at org.junit.runners.ParentRunner.run(ParentRunner.java:300)
	at 
org.apache.maven.surefire.junit4.JUnit4TestSet.execute(JUnit4TestSet.java:53)
	at 
org.apache.maven.surefire.junit4.JUnit4Provider.executeTestSet(JUnit4Provider.java:123)
	at 
org.apache.maven.surefire.junit4.JUnit4Provider.invoke(JUnit4Provider.java:104)
	at sun.reflect.NativeMethodAccessorImpl.invoke0(Native Method)
	at 
sun.reflect.NativeMethodAccessorImpl.invoke(NativeMethodAccessorImpl.java:57)
	at 
sun.reflect.DelegatingMethodAccessorImpl.invoke(DelegatingMethodAccessorImpl.java:43)
	at java.lang.reflect.Method.invoke(Method.java:601)
	at 
org.apache.maven.surefire.util.ReflectionUtils.invokeMethodWithArray(ReflectionUtils.java:164)
	at 
org.apache.maven.surefire.booter.ProviderFactory$ProviderProxy.invoke(ProviderFactory.java:110)
	at 
org.apache.maven.surefire.booter.SurefireStarter.invokeProvider(SurefireStarter.java:172)
	at 
org.apache.maven.surefire.booter.SurefireStarter.runSuitesInProcessWhenForked(SurefireStarter.java:104)
	at 
org.apache.maven.surefire.booter.ForkedBooter.main(ForkedBooter.java:70)
========================== %< ====================

Tests for other JDKs are fine.

- Jörg


---------------------------------------------------------------------
To unsubscribe, e-mail: dev-unsubscribe@commons.apache.org
For additional commands, e-mail: dev-help@commons.apache.org


Mime
View raw message