commons-dev mailing list archives

Site index · List index
Message view « Date » · « Thread »
Top « Date » · « Thread »
From Elijah Zupancic <eli...@zupancic.name>
Subject Re: [chain] Upgrading to Maven parent version 21
Date Sun, 31 Jul 2011 23:23:23 GMT
My maven version is:

Apache Maven 2.2.1 (rdebian-4)
Java version: 1.6.0_16
Java home: /usr/lib/jvm/java-6-sun-1.6.0.16/jre
Default locale: en_US, platform encoding: UTF-8
OS name: "linux" version: "2.6.35-30-generic" arch: "amd64" Family: "unix"


So, it is 2.2.1 like you.

I just logged in in another account with no maven repo and did a
build. Same issue. If this is working for everyone else, I'm very
suspicious that there is something wrong with my system. I will wait
until I can test from another system before I put any more time into
this issue.

Thanks,
-Elijah

Here is the log:
[INFO] Scanning for projects...
Downloading: http://repo1.maven.org/maven2/org/apache/commons/commons-parent/21/commons-parent-21.pom

Downloading: http://repo1.maven.org/maven2/org/apache/apache/9/apache-9.pom

[INFO] ------------------------------------------------------------------------
[INFO] Building Commons Chain
[INFO]    task-segment: [clean, test]
[INFO] ------------------------------------------------------------------------
Downloading: http://repo1.maven.org/maven2/org/apache/maven/plugins/maven-clean-plugin/2.4/maven-clean-plugin-2.4.pom

Downloading: http://repo1.maven.org/maven2/org/apache/maven/plugins/maven-plugins/16/maven-plugins-16.pom

Downloading: http://repo1.maven.org/maven2/org/apache/maven/maven-parent/15/maven-parent-15.pom

Downloading: http://repo1.maven.org/maven2/org/apache/apache/6/apache-6.pom

Downloading: http://repo1.maven.org/maven2/org/apache/maven/plugins/maven-clean-plugin/2.4/maven-clean-plugin-2.4.jar

Downloading: http://repo1.maven.org/maven2/org/apache/maven/plugins/maven-remote-resources-plugin/1.1/maven-remote-resources-plugin-1.1.pom

Downloading: http://repo1.maven.org/maven2/org/apache/maven/plugins/maven-plugins/14/maven-plugins-14.pom

Downloading: http://repo1.maven.org/maven2/org/apache/maven/maven-parent/13/maven-parent-13.pom

Downloading: http://repo1.maven.org/maven2/org/apache/maven/plugins/maven-remote-resources-plugin/1.1/maven-remote-resources-plugin-1.1.jar

Downloading: http://repo1.maven.org/maven2/org/apache/maven/plugins/maven-compiler-plugin/2.1/maven-compiler-plugin-2.1.pom

Downloading: http://repo1.maven.org/maven2/org/apache/maven/plugins/maven-compiler-plugin/2.1/maven-compiler-plugin-2.1.jar

Downloading: http://repo1.maven.org/maven2/org/apache/maven/plugins/maven-surefire-plugin/2.8.1/maven-surefire-plugin-2.8.1.pom

Downloading: http://repo1.maven.org/maven2/org/apache/maven/surefire/surefire/2.8.1/surefire-2.8.1.pom

Downloading: http://repo1.maven.org/maven2/org/apache/maven/maven-parent/19/maven-parent-19.pom

Downloading: http://repo1.maven.org/maven2/org/apache/maven/plugins/maven-surefire-plugin/2.8.1/maven-surefire-plugin-2.8.1.jar

Downloading: http://repo1.maven.org/maven2/org/apache/maven/plugins/maven-jar-plugin/2.3/maven-jar-plugin-2.3.pom

Downloading: http://repo1.maven.org/maven2/org/apache/maven/plugins/maven-jar-plugin/2.3/maven-jar-plugin-2.3.jar

Downloading: http://repo1.maven.org/maven2/org/apache/felix/maven-bundle-plugin/1.4.3/maven-bundle-plugin-1.4.3.pom

Downloading: http://repo1.maven.org/maven2/org/apache/felix/felix/1.0.2/felix-1.0.2.pom

Downloading: http://repo1.maven.org/maven2/org/apache/apache/4/apache-4.pom

Downloading: http://repo1.maven.org/maven2/org/apache/felix/maven-bundle-plugin/1.4.3/maven-bundle-plugin-1.4.3.jar

[INFO] artifact org.apache.maven.plugins:maven-idea-plugin: checking
for updates from central
Downloading: http://repo1.maven.org/maven2/org/apache/maven/plugins/maven-idea-plugin/2.2/maven-idea-plugin-2.2.pom

Downloading: http://repo1.maven.org/maven2/org/apache/maven/plugins/maven-plugins/11/maven-plugins-11.pom

Downloading: http://repo1.maven.org/maven2/org/apache/maven/maven-parent/8/maven-parent-8.pom

Downloading: http://repo1.maven.org/maven2/org/apache/maven/plugins/maven-idea-plugin/2.2/maven-idea-plugin-2.2.jar

Downloading: http://repo1.maven.org/maven2/org/apache/maven/plugins/maven-antrun-plugin/1.5/maven-antrun-plugin-1.5.pom

Downloading: http://repo1.maven.org/maven2/org/apache/maven/plugins/maven-plugins/18/maven-plugins-18.pom

Downloading: http://repo1.maven.org/maven2/org/apache/maven/maven-parent/16/maven-parent-16.pom

Downloading: http://repo1.maven.org/maven2/org/apache/apache/7/apache-7.pom

Downloading: http://repo1.maven.org/maven2/org/apache/maven/plugins/maven-antrun-plugin/1.5/maven-antrun-plugin-1.5.jar

Downloading: http://repo1.maven.org/maven2/org/apache/commons/commons-build-plugin/1.3/commons-build-plugin-1.3.pom

Downloading: http://repo1.maven.org/maven2/org/apache/commons/commons-parent/12/commons-parent-12.pom

Downloading: http://repo1.maven.org/maven2/org/apache/commons/commons-build-plugin/1.3/commons-build-plugin-1.3.jar

Downloading: http://repo1.maven.org/maven2/org/apache/maven/plugins/maven-assembly-plugin/2.2.1/maven-assembly-plugin-2.2.1.pom

Downloading: http://repo1.maven.org/maven2/org/apache/maven/plugins/maven-plugins/19/maven-plugins-19.pom

Downloading: http://repo1.maven.org/maven2/org/apache/maven/plugins/maven-assembly-plugin/2.2.1/maven-assembly-plugin-2.2.1.jar

Downloading: http://repo1.maven.org/maven2/org/apache/maven/maven-plugin-api/2.0.6/maven-plugin-api-2.0.6.pom

Downloading: http://repo1.maven.org/maven2/org/apache/maven/maven/2.0.6/maven-2.0.6.pom

Downloading: http://repo1.maven.org/maven2/org/apache/maven/maven-parent/5/maven-parent-5.pom

Downloading: http://repo1.maven.org/maven2/org/apache/apache/3/apache-3.pom

Downloading: http://repo1.maven.org/maven2/org/codehaus/plexus/plexus-utils/1.5.6/plexus-utils-1.5.6.pom

Downloading: http://repo1.maven.org/maven2/org/codehaus/plexus/plexus/1.0.12/plexus-1.0.12.pom

Downloading: http://repo1.maven.org/maven2/org/codehaus/plexus/plexus-utils/1.5.6/plexus-utils-1.5.6.jar

[INFO] [clean:clean {execution: default-clean}]
[INFO] Deleting /tmp/trunk/target
[INFO] ------------------------------------------------------------------------
[ERROR] BUILD ERROR
[INFO] ------------------------------------------------------------------------
[INFO] Failed to clean project: Failed to delete
/tmp/trunk/target/antrun/build-main.xml

[INFO] ------------------------------------------------------------------------
[INFO] For more information, run Maven with the -e switch
[INFO] ------------------------------------------------------------------------
[INFO] Total time: 47 seconds
[INFO] Finished at: Sun Jul 31 16:11:39 PDT 2011
[INFO] Final Memory: 17M/60M
[INFO] ------------------------------------------------------------------------
cindy@konjo:/tmp/trunk$ mvn clean test
[INFO] Scanning for projects...
[INFO] ------------------------------------------------------------------------
[INFO] Building Commons Chain
[INFO]    task-segment: [clean, test]
[INFO] ------------------------------------------------------------------------
[INFO] [clean:clean {execution: default-clean}]
Downloading: http://repo1.maven.org/maven2/org/apache/maven/plugins/maven-resources-plugin/2.4.1/maven-resources-plugin-2.4.1.pom

Downloading: http://repo1.maven.org/maven2/org/apache/maven/plugins/maven-resources-plugin/2.4.1/maven-resources-plugin-2.4.1.jar

Downloading: http://repo1.maven.org/maven2/commons-beanutils/commons-beanutils/1.8.2/commons-beanutils-1.8.2.pom

Downloading: http://repo1.maven.org/maven2/commons-logging/commons-logging/1.1.1/commons-logging-1.1.1.pom

Downloading: http://repo1.maven.org/maven2/org/apache/commons/commons-parent/5/commons-parent-5.pom

Downloading: http://repo1.maven.org/maven2/commons-digester/commons-digester/1.8/commons-digester-1.8.pom

Downloading: http://repo1.maven.org/maven2/commons-beanutils/commons-beanutils/1.7.0/commons-beanutils-1.7.0.pom

Downloading: http://repo1.maven.org/maven2/commons-logging/commons-logging/1.1/commons-logging-1.1.pom

Downloading: http://repo1.maven.org/maven2/javax/servlet/servlet-api/2.3/servlet-api-2.3.pom

Downloading: http://repo1.maven.org/maven2/javax/portlet/portlet-api/1.0/portlet-api-1.0.pom

Downloading: http://repo1.maven.org/maven2/myfaces/myfaces-api/1.1.0/myfaces-api-1.1.0.pom

Downloading: http://repo1.maven.org/maven2/myfaces/myfaces-parent/1.1.0/myfaces-parent-1.1.0.pom

Downloading: http://repo1.maven.org/maven2/commons-digester/commons-digester/1.7/commons-digester-1.7.pom

Downloading: http://repo1.maven.org/maven2/commons-logging/commons-logging/1.0.4/commons-logging-1.0.4.pom

Downloading: http://repo1.maven.org/maven2/javax/servlet/jstl/1.1.2/jstl-1.1.2.pom

Downloading: http://repo1.maven.org/maven2/junit/junit/3.8.1/junit-3.8.1.pom

Downloading: http://repo1.maven.org/maven2/commons-logging/commons-logging/1.1.1/commons-logging-1.1.1.jar
Downloading: http://repo1.maven.org/maven2/javax/servlet/servlet-api/2.3/servlet-api-2.3.jar
Downloading: http://repo1.maven.org/maven2/myfaces/myfaces-api/1.1.0/myfaces-api-1.1.0.jar
Downloading: http://repo1.maven.org/maven2/commons-digester/commons-digester/1.8/commons-digester-1.8.jar
Downloading: http://repo1.maven.org/maven2/junit/junit/3.8.1/junit-3.8.1.jar

Downloading: http://repo1.maven.org/maven2/javax/portlet/portlet-api/1.0/portlet-api-1.0.jar

Downloading: http://repo1.maven.org/maven2/commons-beanutils/commons-beanutils/1.8.2/commons-beanutils-1.8.2.jar

Downloading: http://repo1.maven.org/maven2/javax/servlet/jstl/1.1.2/jstl-1.1.2.jar





Downloading: http://repo1.maven.org/maven2/org/apache/maven/maven-plugin-api/2.0.11/maven-plugin-api-2.0.11.pom

Downloading: http://repo1.maven.org/maven2/org/apache/maven/maven/2.0.11/maven-2.0.11.pom

Downloading: http://repo1.maven.org/maven2/org/apache/maven/maven-parent/12/maven-parent-12.pom

Downloading: http://repo1.maven.org/maven2/org/apache/maven/maven-project/2.0.11/maven-project-2.0.11.pom

Downloading: http://repo1.maven.org/maven2/org/apache/maven/maven-settings/2.0.11/maven-settings-2.0.11.pom

Downloading: http://repo1.maven.org/maven2/org/apache/maven/maven-model/2.0.11/maven-model-2.0.11.pom

Downloading: http://repo1.maven.org/maven2/org/codehaus/plexus/plexus-interpolation/1.1/plexus-interpolation-1.1.pom

Downloading: http://repo1.maven.org/maven2/org/codehaus/plexus/plexus/1.0.11/plexus-1.0.11.pom

Downloading: http://repo1.maven.org/maven2/org/codehaus/plexus/plexus-container-default/1.0-alpha-9-stable-1/plexus-container-default-1.0-alpha-9-stable-1.pom

Downloading: http://repo1.maven.org/maven2/org/codehaus/plexus/plexus-containers/1.0.3/plexus-containers-1.0.3.pom

Downloading: http://repo1.maven.org/maven2/org/codehaus/plexus/plexus/1.0.4/plexus-1.0.4.pom

Downloading: http://repo1.maven.org/maven2/org/codehaus/plexus/plexus-utils/1.0.4/plexus-utils-1.0.4.pom

Downloading: http://repo1.maven.org/maven2/classworlds/classworlds/1.1-alpha-2/classworlds-1.1-alpha-2.pom

Downloading: http://repo1.maven.org/maven2/org/apache/maven/maven-profile/2.0.11/maven-profile-2.0.11.pom

Downloading: http://repo1.maven.org/maven2/org/apache/maven/maven-artifact-manager/2.0.11/maven-artifact-manager-2.0.11.pom

Downloading: http://repo1.maven.org/maven2/org/apache/maven/maven-repository-metadata/2.0.11/maven-repository-metadata-2.0.11.pom

Downloading: http://repo1.maven.org/maven2/org/apache/maven/maven-artifact/2.0.11/maven-artifact-2.0.11.pom

Downloading: http://repo1.maven.org/maven2/org/apache/maven/wagon/wagon-provider-api/1.0-beta-2/wagon-provider-api-1.0-beta-2.pom

Downloading: http://repo1.maven.org/maven2/org/apache/maven/wagon/wagon/1.0-beta-2/wagon-1.0-beta-2.pom

Downloading: http://repo1.maven.org/maven2/org/apache/maven/maven-parent/4/maven-parent-4.pom

Downloading: http://repo1.maven.org/maven2/org/apache/maven/maven-plugin-registry/2.0.11/maven-plugin-registry-2.0.11.pom

Downloading: http://repo1.maven.org/maven2/org/codehaus/plexus/plexus-utils/2.0.5/plexus-utils-2.0.5.pom

Downloading: http://repo1.maven.org/maven2/org/codehaus/plexus/plexus/2.0.6/plexus-2.0.6.pom

Downloading: http://repo1.maven.org/maven2/org/apache/ant/ant-nodeps/1.8.1/ant-nodeps-1.8.1.pom

Downloading: http://repo1.maven.org/maven2/org/apache/ant/ant-parent/1.8.1/ant-parent-1.8.1.pom

Downloading: http://repo1.maven.org/maven2/org/apache/ant/ant/1.8.1/ant-1.8.1.pom

Downloading: http://repo1.maven.org/maven2/org/apache/ant/ant-launcher/1.8.1/ant-launcher-1.8.1.pom

Downloading: http://repo1.maven.org/maven2/org/codehaus/plexus/plexus-utils/2.0.5/plexus-utils-2.0.5.jar
Downloading: http://repo1.maven.org/maven2/org/apache/ant/ant-nodeps/1.8.1/ant-nodeps-1.8.1.jar


Downloading: http://repo1.maven.org/maven2/org/apache/ant/ant/1.8.1/ant-1.8.1.jar

Downloading: http://repo1.maven.org/maven2/org/apache/ant/ant-launcher/1.8.1/ant-launcher-1.8.1.jar

[INFO] [antrun:run {execution: javadoc.resources}]
[INFO] Executing tasks

main:
     [copy] Copying 2 files to /tmp/trunk/target/apidocs/META-INF
[INFO] Executed tasks
Downloading: http://repo1.maven.org/maven2/org/apache/maven/shared/maven-artifact-resolver/1.0/maven-artifact-resolver-1.0.pom

Downloading: http://repo1.maven.org/maven2/org/apache/maven/shared/maven-shared-components/12/maven-shared-components-12.pom

Downloading: http://repo1.maven.org/maven2/org/apache/maven/shared/maven-filtering/1.0-beta-3/maven-filtering-1.0-beta-3.pom

Downloading: http://repo1.maven.org/maven2/org/apache/maven/shared/maven-shared-components/11/maven-shared-components-11.pom

Downloading: http://repo1.maven.org/maven2/org/apache/maven/maven-parent/11/maven-parent-11.pom

Downloading: http://repo1.maven.org/maven2/org/apache/apache/5/apache-5.pom

Downloading: http://repo1.maven.org/maven2/org/apache/maven/maven-project/2.0.6/maven-project-2.0.6.pom

Downloading: http://repo1.maven.org/maven2/org/apache/maven/maven-settings/2.0.6/maven-settings-2.0.6.pom

Downloading: http://repo1.maven.org/maven2/org/apache/maven/maven-model/2.0.6/maven-model-2.0.6.pom

Downloading: http://repo1.maven.org/maven2/org/codehaus/plexus/plexus-utils/1.4.1/plexus-utils-1.4.1.pom

Downloading: http://repo1.maven.org/maven2/org/apache/maven/maven-profile/2.0.6/maven-profile-2.0.6.pom

Downloading: http://repo1.maven.org/maven2/org/apache/maven/maven-artifact-manager/2.0.6/maven-artifact-manager-2.0.6.pom

Downloading: http://repo1.maven.org/maven2/org/apache/maven/maven-repository-metadata/2.0.6/maven-repository-metadata-2.0.6.pom

Downloading: http://repo1.maven.org/maven2/org/apache/maven/maven-artifact/2.0.6/maven-artifact-2.0.6.pom

Downloading: http://repo1.maven.org/maven2/org/apache/maven/maven-plugin-registry/2.0.6/maven-plugin-registry-2.0.6.pom

Downloading: http://repo1.maven.org/maven2/org/apache/maven/maven-core/2.0.6/maven-core-2.0.6.pom

Downloading: http://repo1.maven.org/maven2/org/apache/maven/wagon/wagon-file/1.0-beta-2/wagon-file-1.0-beta-2.pom

Downloading: http://repo1.maven.org/maven2/org/apache/maven/wagon/wagon-providers/1.0-beta-2/wagon-providers-1.0-beta-2.pom

Downloading: http://repo1.maven.org/maven2/org/apache/maven/maven-plugin-parameter-documenter/2.0.6/maven-plugin-parameter-documenter-2.0.6.pom

Downloading: http://repo1.maven.org/maven2/org/apache/maven/wagon/wagon-http-lightweight/1.0-beta-2/wagon-http-lightweight-1.0-beta-2.pom

Downloading: http://repo1.maven.org/maven2/org/apache/maven/wagon/wagon-http-shared/1.0-beta-2/wagon-http-shared-1.0-beta-2.pom

Downloading: http://repo1.maven.org/maven2/jtidy/jtidy/4aug2000r7-dev/jtidy-4aug2000r7-dev.pom

Downloading: http://repo1.maven.org/maven2/xml-apis/xml-apis/1.0.b2/xml-apis-1.0.b2.pom

Downloading: http://repo1.maven.org/maven2/org/apache/maven/reporting/maven-reporting-api/2.0.6/maven-reporting-api-2.0.6.pom

Downloading: http://repo1.maven.org/maven2/org/apache/maven/reporting/maven-reporting/2.0.6/maven-reporting-2.0.6.pom

Downloading: http://repo1.maven.org/maven2/org/apache/maven/doxia/doxia-sink-api/1.0-alpha-7/doxia-sink-api-1.0-alpha-7.pom

Downloading: http://repo1.maven.org/maven2/org/apache/maven/doxia/doxia/1.0-alpha-7/doxia-1.0-alpha-7.pom

Downloading: http://repo1.maven.org/maven2/org/apache/maven/maven-error-diagnostics/2.0.6/maven-error-diagnostics-2.0.6.pom

Downloading: http://repo1.maven.org/maven2/commons-cli/commons-cli/1.0/commons-cli-1.0.pom

Downloading: http://repo1.maven.org/maven2/org/apache/maven/wagon/wagon-ssh-external/1.0-beta-2/wagon-ssh-external-1.0-beta-2.pom

Downloading: http://repo1.maven.org/maven2/org/apache/maven/wagon/wagon-ssh-common/1.0-beta-2/wagon-ssh-common-1.0-beta-2.pom

Downloading: http://repo1.maven.org/maven2/org/codehaus/plexus/plexus-interactivity-api/1.0-alpha-4/plexus-interactivity-api-1.0-alpha-4.pom

Downloading: http://repo1.maven.org/maven2/org/codehaus/plexus/plexus-container-default/1.0-alpha-7/plexus-container-default-1.0-alpha-7.pom

Downloading: http://repo1.maven.org/maven2/plexus/plexus-containers/1.0.2/plexus-containers-1.0.2.pom

Downloading: http://repo1.maven.org/maven2/plexus/plexus-root/1.0.3/plexus-root-1.0.3.pom

Downloading: http://repo1.maven.org/maven2/plexus/plexus-utils/1.0.2/plexus-utils-1.0.2.pom

Downloading: http://repo1.maven.org/maven2/org/apache/maven/maven-plugin-descriptor/2.0.6/maven-plugin-descriptor-2.0.6.pom

Downloading: http://repo1.maven.org/maven2/org/apache/maven/maven-monitor/2.0.6/maven-monitor-2.0.6.pom

Downloading: http://repo1.maven.org/maven2/org/apache/maven/wagon/wagon-ssh/1.0-beta-2/wagon-ssh-1.0-beta-2.pom

Downloading: http://repo1.maven.org/maven2/com/jcraft/jsch/0.1.27/jsch-0.1.27.pom

Downloading: http://repo1.maven.org/maven2/classworlds/classworlds/1.1/classworlds-1.1.pom

Downloading: http://repo1.maven.org/maven2/org/codehaus/plexus/plexus-utils/1.5.15/plexus-utils-1.5.15.pom

Downloading: http://repo1.maven.org/maven2/org/codehaus/plexus/plexus/2.0.2/plexus-2.0.2.pom

Downloading: http://repo1.maven.org/maven2/org/codehaus/plexus/plexus-interpolation/1.12/plexus-interpolation-1.12.pom

Downloading: http://repo1.maven.org/maven2/org/codehaus/plexus/plexus-components/1.1.14/plexus-components-1.1.14.pom

Downloading: http://repo1.maven.org/maven2/org/sonatype/plexus/plexus-build-api/0.0.4/plexus-build-api-0.0.4.pom

Downloading: http://repo1.maven.org/maven2/org/sonatype/spice/spice-parent/10/spice-parent-10.pom

Downloading: http://repo1.maven.org/maven2/org/sonatype/forge/forge-parent/3/forge-parent-3.pom

Downloading: http://repo1.maven.org/maven2/org/codehaus/plexus/plexus-utils/1.5.8/plexus-utils-1.5.8.pom

Downloading: http://repo1.maven.org/maven2/org/apache/maven/maven-project/2.0.5/maven-project-2.0.5.pom

Downloading: http://repo1.maven.org/maven2/org/apache/maven/maven/2.0.5/maven-2.0.5.pom

Downloading: http://repo1.maven.org/maven2/org/apache/maven/maven-settings/2.0.5/maven-settings-2.0.5.pom

Downloading: http://repo1.maven.org/maven2/org/apache/maven/maven-profile/2.0.5/maven-profile-2.0.5.pom

Downloading: http://repo1.maven.org/maven2/org/apache/maven/maven-model/2.0.5/maven-model-2.0.5.pom

Downloading: http://repo1.maven.org/maven2/org/codehaus/plexus/plexus-utils/1.1/plexus-utils-1.1.pom

Downloading: http://repo1.maven.org/maven2/org/codehaus/plexus/plexus-container-default/1.0-alpha-9/plexus-container-default-1.0-alpha-9.pom

Downloading: http://repo1.maven.org/maven2/org/apache/maven/maven-artifact-manager/2.0.5/maven-artifact-manager-2.0.5.pom

Downloading: http://repo1.maven.org/maven2/org/apache/maven/maven-repository-metadata/2.0.5/maven-repository-metadata-2.0.5.pom

Downloading: http://repo1.maven.org/maven2/org/apache/maven/maven-artifact/2.0.5/maven-artifact-2.0.5.pom

Downloading: http://repo1.maven.org/maven2/org/apache/maven/maven-core/2.0.5/maven-core-2.0.5.pom

Downloading: http://repo1.maven.org/maven2/org/apache/maven/maven-plugin-parameter-documenter/2.0.5/maven-plugin-parameter-documenter-2.0.5.pom

Downloading: http://repo1.maven.org/maven2/org/apache/maven/reporting/maven-reporting-api/2.0.5/maven-reporting-api-2.0.5.pom

Downloading: http://repo1.maven.org/maven2/org/apache/maven/reporting/maven-reporting/2.0.5/maven-reporting-2.0.5.pom

Downloading: http://repo1.maven.org/maven2/org/apache/maven/maven-error-diagnostics/2.0.5/maven-error-diagnostics-2.0.5.pom

Downloading: http://repo1.maven.org/maven2/org/apache/maven/maven-plugin-registry/2.0.5/maven-plugin-registry-2.0.5.pom

Downloading: http://repo1.maven.org/maven2/org/apache/maven/maven-plugin-api/2.0.5/maven-plugin-api-2.0.5.pom

Downloading: http://repo1.maven.org/maven2/org/apache/maven/maven-plugin-descriptor/2.0.5/maven-plugin-descriptor-2.0.5.pom

Downloading: http://repo1.maven.org/maven2/org/apache/maven/maven-monitor/2.0.5/maven-monitor-2.0.5.pom

Downloading: http://repo1.maven.org/maven2/velocity/velocity-dep/1.4/velocity-dep-1.4.pom

Downloading: http://repo1.maven.org/maven2/org/apache/maven/shared/maven-common-artifact-filters/1.0/maven-common-artifact-filters-1.0.pom

Downloading: http://repo1.maven.org/maven2/org/apache/maven/shared/maven-shared-components/8/maven-shared-components-8.pom

Downloading: http://repo1.maven.org/maven2/org/apache/maven/maven-parent/7/maven-parent-7.pom

Downloading: http://repo1.maven.org/maven2/org/apache/maven/maven-artifact/2.0.8/maven-artifact-2.0.8.pom

Downloading: http://repo1.maven.org/maven2/org/apache/maven/maven/2.0.8/maven-2.0.8.pom

Downloading: http://repo1.maven.org/maven2/org/apache/maven/maven-parent/6/maven-parent-6.pom

Downloading: http://repo1.maven.org/maven2/org/apache/maven/shared/maven-plugin-testing-harness/1.1/maven-plugin-testing-harness-1.1.pom

Downloading: http://repo1.maven.org/maven2/org/apache/maven/shared/maven-shared-components/7/maven-shared-components-7.pom

Downloading: http://repo1.maven.org/maven2/org/apache/maven/maven-project/2.0/maven-project-2.0.pom

Downloading: http://repo1.maven.org/maven2/org/apache/maven/maven/2.0/maven-2.0.pom

Downloading: http://repo1.maven.org/maven2/org/apache/maven/maven-core/2.0/maven-core-2.0.pom

Downloading: http://repo1.maven.org/maven2/org/codehaus/plexus/plexus-utils/1.4.2/plexus-utils-1.4.2.pom

Downloading: http://repo1.maven.org/maven2/org/codehaus/plexus/plexus-archiver/1.0-alpha-7/plexus-archiver-1.0-alpha-7.pom

Downloading: http://repo1.maven.org/maven2/org/codehaus/plexus/plexus-components/1.1.6/plexus-components-1.1.6.pom

Downloading: http://repo1.maven.org/maven2/org/codehaus/plexus/plexus/1.0.8/plexus-1.0.8.pom

Downloading: http://repo1.maven.org/maven2/org/codehaus/plexus/plexus-utils/1.2/plexus-utils-1.2.pom

Downloading: http://repo1.maven.org/maven2/org/codehaus/plexus/plexus/1.0.5/plexus-1.0.5.pom

Downloading: http://repo1.maven.org/maven2/org/codehaus/plexus/plexus-container-default/1.0-alpha-8/plexus-container-default-1.0-alpha-8.pom

Downloading: http://repo1.maven.org/maven2/org/apache/maven/shared/maven-downloader/1.1/maven-downloader-1.1.pom

Downloading: http://repo1.maven.org/maven2/org/apache/maven/shared/maven-shared-components/4/maven-shared-components-4.pom

Downloading: http://repo1.maven.org/maven2/org/apache/maven/maven-artifact-manager/2.0/maven-artifact-manager-2.0.pom

Downloading: http://repo1.maven.org/maven2/org/apache/maven/maven-artifact/2.0/maven-artifact-2.0.pom

Downloading: http://repo1.maven.org/maven2/org/codehaus/plexus/plexus-utils/1.5.12/plexus-utils-1.5.12.pom

Downloading: http://repo1.maven.org/maven2/org/codehaus/plexus/plexus-velocity/1.1.3/plexus-velocity-1.1.3.pom

Downloading: http://repo1.maven.org/maven2/org/codehaus/plexus/plexus-components/1.1.5/plexus-components-1.1.5.pom

Downloading: http://repo1.maven.org/maven2/commons-collections/commons-collections/2.0/commons-collections-2.0.pom

Downloading: http://repo1.maven.org/maven2/velocity/velocity/1.4/velocity-1.4.pom

Downloading: http://repo1.maven.org/maven2/org/codehaus/plexus/plexus-resources/1.0-alpha-5/plexus-resources-1.0-alpha-5.pom

Downloading: http://repo1.maven.org/maven2/org/codehaus/plexus/plexus-utils/1.5.5/plexus-utils-1.5.5.pom

Downloading: http://repo1.maven.org/maven2/org/sonatype/plexus/plexus-build-api/0.0.4/plexus-build-api-0.0.4.jar
Downloading: http://repo1.maven.org/maven2/velocity/velocity-dep/1.4/velocity-dep-1.4.jar
Downloading: http://repo1.maven.org/maven2/commons-collections/commons-collections/2.0/commons-collections-2.0.jar
Downloading: http://repo1.maven.org/maven2/org/apache/maven/shared/maven-artifact-resolver/1.0/maven-artifact-resolver-1.0.jar
Downloading: http://repo1.maven.org/maven2/org/codehaus/plexus/plexus-utils/1.5.12/plexus-utils-1.5.12.jar


Downloading: http://repo1.maven.org/maven2/org/apache/maven/shared/maven-filtering/1.0-beta-3/maven-filtering-1.0-beta-3.jar

Downloading: http://repo1.maven.org/maven2/org/apache/maven/shared/maven-common-artifact-filters/1.0/maven-common-artifact-filters-1.0.jar


Downloading: http://repo1.maven.org/maven2/org/apache/maven/shared/maven-plugin-testing-harness/1.1/maven-plugin-testing-harness-1.1.jar

Downloading: http://repo1.maven.org/maven2/org/apache/maven/shared/maven-downloader/1.1/maven-downloader-1.1.jar


Downloading: http://repo1.maven.org/maven2/org/codehaus/plexus/plexus-interpolation/1.12/plexus-interpolation-1.12.jar

Downloading: http://repo1.maven.org/maven2/org/codehaus/plexus/plexus-archiver/1.0-alpha-7/plexus-archiver-1.0-alpha-7.jar

Downloading: http://repo1.maven.org/maven2/velocity/velocity/1.4/velocity-1.4.jar

Downloading: http://repo1.maven.org/maven2/org/codehaus/plexus/plexus-velocity/1.1.3/plexus-velocity-1.1.3.jar

Downloading: http://repo1.maven.org/maven2/org/codehaus/plexus/plexus-resources/1.0-alpha-5/plexus-resources-1.0-alpha-5.jar


[INFO] Setting property: classpath.resource.loader.class =>
'org.codehaus.plexus.velocity.ContextClassLoaderResourceLoader'.
[INFO] Setting property: velocimacro.messages.on => 'false'.
[INFO] Setting property: resource.loader => 'classpath'.
[INFO] Setting property: resource.manager.logwhenfound => 'false'.
[INFO] [remote-resources:process {execution: default}]
Downloading: http://repo1.maven.org/maven2/org/codehaus/plexus/plexus-interpolation/1.13/plexus-interpolation-1.13.pom

Downloading: http://repo1.maven.org/maven2/org/codehaus/plexus/plexus-components/1.1.15/plexus-components-1.1.15.pom

Downloading: http://repo1.maven.org/maven2/org/codehaus/plexus/plexus/2.0.3/plexus-2.0.3.pom

Downloading: http://repo1.maven.org/maven2/org/codehaus/plexus/plexus-utils/1.5.15/plexus-utils-1.5.15.jar

Downloading: http://repo1.maven.org/maven2/org/codehaus/plexus/plexus-interpolation/1.13/plexus-interpolation-1.13.jar

[INFO] [resources:resources {execution: default-resources}]
[INFO] Using 'iso-8859-1' encoding to copy filtered resources.
[INFO] Copying 2 resources to META-INF
Downloading: http://repo1.maven.org/maven2/org/apache/maven/maven-plugin-api/2.0/maven-plugin-api-2.0.pom

Downloading: http://repo1.maven.org/maven2/org/codehaus/plexus/plexus-utils/1.5.1/plexus-utils-1.5.1.pom

Downloading: http://repo1.maven.org/maven2/org/codehaus/plexus/plexus-compiler-api/1.6/plexus-compiler-api-1.6.pom

Downloading: http://repo1.maven.org/maven2/org/codehaus/plexus/plexus-compiler/1.6/plexus-compiler-1.6.pom

Downloading: http://repo1.maven.org/maven2/org/codehaus/plexus/plexus-components/1.1.16/plexus-components-1.1.16.pom

Downloading: http://repo1.maven.org/maven2/org/codehaus/plexus/plexus/2.0.4/plexus-2.0.4.pom

Downloading: http://repo1.maven.org/maven2/org/apache/maven/maven-toolchain/1.0/maven-toolchain-1.0.pom

Downloading: http://repo1.maven.org/maven2/org/codehaus/plexus/plexus-compiler-manager/1.6/plexus-compiler-manager-1.6.pom

Downloading: http://repo1.maven.org/maven2/org/codehaus/plexus/plexus-compiler-javac/1.6/plexus-compiler-javac-1.6.pom

Downloading: http://repo1.maven.org/maven2/org/codehaus/plexus/plexus-compilers/1.6/plexus-compilers-1.6.pom

Downloading: http://repo1.maven.org/maven2/org/codehaus/plexus/plexus-utils/1.5.1/plexus-utils-1.5.1.jar

Downloading: http://repo1.maven.org/maven2/org/codehaus/plexus/plexus-compiler-api/1.6/plexus-compiler-api-1.6.jar

Downloading: http://repo1.maven.org/maven2/org/codehaus/plexus/plexus-compiler-manager/1.6/plexus-compiler-manager-1.6.jar

Downloading: http://repo1.maven.org/maven2/org/codehaus/plexus/plexus-compiler-javac/1.6/plexus-compiler-javac-1.6.jar

[INFO] [compiler:compile {execution: default-compile}]
[INFO] Compiling 55 source files to /tmp/trunk/target/classes
Downloading: http://repo1.maven.org/maven2/biz/aQute/bndlib/0.0.255/bndlib-0.0.255.pom

Downloading: http://repo1.maven.org/maven2/net/sf/kxml/kxml2/2.2.2/kxml2-2.2.2.pom

Downloading: http://repo1.maven.org/maven2/xmlpull/xmlpull/1.1.3.1/xmlpull-1.1.3.1.pom

Downloading: http://repo1.maven.org/maven2/org/apache/felix/org.osgi.core/1.0.0/org.osgi.core-1.0.0.pom

Downloading: http://repo1.maven.org/maven2/org/apache/felix/felix/1.0.0/felix-1.0.0.pom

Downloading: http://repo1.maven.org/maven2/org/apache/felix/org.osgi.service.obr/1.0.1/org.osgi.service.obr-1.0.1.pom

Downloading: http://repo1.maven.org/maven2/org/apache/maven/maven-project/2.0.7/maven-project-2.0.7.pom

Downloading: http://repo1.maven.org/maven2/org/apache/maven/maven/2.0.7/maven-2.0.7.pom

Downloading: http://repo1.maven.org/maven2/org/apache/maven/maven-settings/2.0.7/maven-settings-2.0.7.pom

Downloading: http://repo1.maven.org/maven2/org/apache/maven/maven-model/2.0.7/maven-model-2.0.7.pom

Downloading: http://repo1.maven.org/maven2/org/apache/maven/maven-profile/2.0.7/maven-profile-2.0.7.pom

Downloading: http://repo1.maven.org/maven2/org/apache/maven/maven-artifact-manager/2.0.7/maven-artifact-manager-2.0.7.pom

Downloading: http://repo1.maven.org/maven2/org/apache/maven/maven-repository-metadata/2.0.7/maven-repository-metadata-2.0.7.pom

Downloading: http://repo1.maven.org/maven2/org/apache/maven/maven-artifact/2.0.7/maven-artifact-2.0.7.pom

Downloading: http://repo1.maven.org/maven2/org/apache/maven/maven-plugin-registry/2.0.7/maven-plugin-registry-2.0.7.pom

Downloading: http://repo1.maven.org/maven2/org/apache/maven/maven-plugin-api/2.0.7/maven-plugin-api-2.0.7.pom

Downloading: http://repo1.maven.org/maven2/org/apache/maven/maven-archiver/2.2/maven-archiver-2.2.pom

Downloading: http://repo1.maven.org/maven2/org/apache/maven/shared/maven-shared-components/3/maven-shared-components-3.pom

Downloading: http://repo1.maven.org/maven2/org/apache/maven/shared/maven-dependency-tree/1.1/maven-dependency-tree-1.1.pom

Downloading: http://repo1.maven.org/maven2/org/apache/maven/maven-project/2.0.8/maven-project-2.0.8.pom

Downloading: http://repo1.maven.org/maven2/org/apache/maven/shared/maven-osgi/0.2.0/maven-osgi-0.2.0.pom

Downloading: http://repo1.maven.org/maven2/biz/aQute/bndlib/0.0.203/bndlib-0.0.203.pom

Downloading: http://repo1.maven.org/maven2/org/codehaus/plexus/plexus-utils/1.4.7/plexus-utils-1.4.7.pom

Downloading: http://repo1.maven.org/maven2/org/codehaus/plexus/plexus-utils/1.4.7/plexus-utils-1.4.7.jar
Downloading: http://repo1.maven.org/maven2/xmlpull/xmlpull/1.1.3.1/xmlpull-1.1.3.1.jar
Downloading: http://repo1.maven.org/maven2/biz/aQute/bndlib/0.0.255/bndlib-0.0.255.jar
Downloading: http://repo1.maven.org/maven2/org/apache/maven/maven-archiver/2.2/maven-archiver-2.2.jar
Downloading: http://repo1.maven.org/maven2/org/apache/maven/shared/maven-dependency-tree/1.1/maven-dependency-tree-1.1.jar



Downloading: http://repo1.maven.org/maven2/org/apache/felix/org.osgi.core/1.0.0/org.osgi.core-1.0.0.jar
Downloading: http://repo1.maven.org/maven2/net/sf/kxml/kxml2/2.2.2/kxml2-2.2.2.jar
Downloading: http://repo1.maven.org/maven2/org/apache/maven/shared/maven-osgi/0.2.0/maven-osgi-0.2.0.jar




Downloading: http://repo1.maven.org/maven2/org/apache/felix/org.osgi.service.obr/1.0.1/org.osgi.service.obr-1.0.1.jar


[INFO] [bundle:manifest {execution: bundle-manifest}]
[WARNING] Warning in manifest for
commons-chain:commons-chain:jar:1.3-SNAPSHOT : Did not find matching
referal for !javax.portlet
[INFO] [resources:testResources {execution: default-testResources}]
[INFO] Using 'iso-8859-1' encoding to copy filtered resources.
[INFO] Copying 2 resources
[INFO] [compiler:testCompile {execution: default-testCompile}]
[INFO] Compiling 37 source files to /tmp/trunk/target/test-classes
Downloading: http://repo1.maven.org/maven2/org/apache/maven/maven-plugin-api/2.0.9/maven-plugin-api-2.0.9.pom

Downloading: http://repo1.maven.org/maven2/org/apache/maven/maven/2.0.9/maven-2.0.9.pom

Downloading: http://repo1.maven.org/maven2/org/apache/maven/surefire/surefire-booter/2.8.1/surefire-booter-2.8.1.pom

Downloading: http://repo1.maven.org/maven2/org/apache/maven/surefire/surefire-api/2.8.1/surefire-api-2.8.1.pom

Downloading: http://repo1.maven.org/maven2/org/apache/maven/surefire/maven-surefire-common/2.8.1/maven-surefire-common-2.8.1.pom

Downloading: http://repo1.maven.org/maven2/org/codehaus/plexus/plexus-utils/2.0.7/plexus-utils-2.0.7.pom

Downloading: http://repo1.maven.org/maven2/org/codehaus/plexus/plexus/2.0.7/plexus-2.0.7.pom

Downloading: http://repo1.maven.org/maven2/org/apache/maven/maven-artifact/2.0.9/maven-artifact-2.0.9.pom

Downloading: http://repo1.maven.org/maven2/org/apache/maven/maven-project/2.0.9/maven-project-2.0.9.pom

Downloading: http://repo1.maven.org/maven2/org/apache/maven/maven-settings/2.0.9/maven-settings-2.0.9.pom

Downloading: http://repo1.maven.org/maven2/org/apache/maven/maven-model/2.0.9/maven-model-2.0.9.pom

Downloading: http://repo1.maven.org/maven2/org/apache/maven/maven-profile/2.0.9/maven-profile-2.0.9.pom

Downloading: http://repo1.maven.org/maven2/org/apache/maven/maven-artifact-manager/2.0.9/maven-artifact-manager-2.0.9.pom

Downloading: http://repo1.maven.org/maven2/org/apache/maven/maven-repository-metadata/2.0.9/maven-repository-metadata-2.0.9.pom

Downloading: http://repo1.maven.org/maven2/org/apache/maven/maven-plugin-registry/2.0.9/maven-plugin-registry-2.0.9.pom

Downloading: http://repo1.maven.org/maven2/org/apache/maven/maven-core/2.0.9/maven-core-2.0.9.pom

Downloading: http://repo1.maven.org/maven2/org/apache/maven/maven-plugin-parameter-documenter/2.0.9/maven-plugin-parameter-documenter-2.0.9.pom

Downloading: http://repo1.maven.org/maven2/org/apache/maven/reporting/maven-reporting-api/2.0.9/maven-reporting-api-2.0.9.pom

Downloading: http://repo1.maven.org/maven2/org/apache/maven/reporting/maven-reporting/2.0.9/maven-reporting-2.0.9.pom

Downloading: http://repo1.maven.org/maven2/org/apache/maven/maven-error-diagnostics/2.0.9/maven-error-diagnostics-2.0.9.pom

Downloading: http://repo1.maven.org/maven2/org/apache/maven/maven-plugin-descriptor/2.0.9/maven-plugin-descriptor-2.0.9.pom

Downloading: http://repo1.maven.org/maven2/org/apache/maven/maven-monitor/2.0.9/maven-monitor-2.0.9.pom

Downloading: http://repo1.maven.org/maven2/org/apache/maven/maven-toolchain/2.0.9/maven-toolchain-2.0.9.pom

Downloading: http://repo1.maven.org/maven2/org/apache/maven/shared/maven-common-artifact-filters/1.3/maven-common-artifact-filters-1.3.pom

Downloading: http://repo1.maven.org/maven2/org/apache/maven/shared/maven-common-artifact-filters/1.3/maven-common-artifact-filters-1.3.jar
Downloading: http://repo1.maven.org/maven2/org/codehaus/plexus/plexus-utils/2.0.7/plexus-utils-2.0.7.jar
Downloading: http://repo1.maven.org/maven2/org/apache/maven/surefire/surefire-booter/2.8.1/surefire-booter-2.8.1.jar


Downloading: http://repo1.maven.org/maven2/org/apache/maven/surefire/surefire-api/2.8.1/surefire-api-2.8.1.jar


Downloading: http://repo1.maven.org/maven2/org/apache/maven/surefire/maven-surefire-common/2.8.1/maven-surefire-common-2.8.1.jar

[INFO] [surefire:test {execution: default-test}]
[INFO] Surefire report directory: /tmp/trunk/target/surefire-reports
Downloading: http://repo1.maven.org/maven2/org/apache/maven/surefire/surefire-junit3/2.8.1/surefire-junit3-2.8.1.pom

Downloading: http://repo1.maven.org/maven2/org/apache/maven/surefire/surefire-providers/2.8.1/surefire-providers-2.8.1.pom

Downloading: http://repo1.maven.org/maven2/org/apache/maven/surefire/surefire-junit3/2.8.1/surefire-junit3-2.8.1.jar


-------------------------------------------------------
 T E S T S
-------------------------------------------------------
Running org.apache.commons.chain.impl.TestContext
Tests run: 0, Failures: 0, Errors: 0, Skipped: 0, Time elapsed: 0.007 sec
Running org.apache.commons.chain.impl.TestContextTestCase
Tests run: 10, Failures: 0, Errors: 0, Skipped: 0, Time elapsed: 0.093 sec
Running org.apache.commons.chain.impl.ContextBaseTestCase
Tests run: 7, Failures: 0, Errors: 0, Skipped: 0, Time elapsed: 0.005 sec
Running org.apache.commons.chain.impl.CatalogFactoryBaseTestCase
Jul 31, 2011 4:16:37 PM org.apache.commons.chain.CatalogFactory getCommand
WARNING: No catalog found for name: foo.
Jul 31, 2011 4:16:37 PM org.apache.commons.chain.CatalogFactory getCommand
WARNING: No catalog found for name: noSuchCatalog.
Tests run: 4, Failures: 0, Errors: 0, Skipped: 0, Time elapsed: 0.114 sec
Running org.apache.commons.chain.impl.ChainBaseTestCase
Tests run: 17, Failures: 0, Errors: 0, Skipped: 0, Time elapsed: 0.016 sec
Running org.apache.commons.chain.impl.CatalogBaseTestCase
Tests run: 3, Failures: 0, Errors: 0, Skipped: 0, Time elapsed: 0.003 sec
Running org.apache.commons.chain.web.servlet.ChainProcessorTestCase
Jul 31, 2011 4:16:37 PM
org.apache.commons.chain.web.servlet.MockServletContext log
INFO: test: init
Jul 31, 2011 4:16:37 PM org.apache.commons.chain.web.ChainServlet init
INFO: Initializing chain servlet 'test'
Tests run: 1, Failures: 0, Errors: 0, Skipped: 0, Time elapsed: 0.041 sec
Running org.apache.commons.chain.web.servlet.ServletGetLocaleCommandTestCase
Tests run: 2, Failures: 0, Errors: 0, Skipped: 0, Time elapsed: 0.02 sec
Running org.apache.commons.chain.web.servlet.ServletWebContextTestCase
Tests run: 18, Failures: 0, Errors: 0, Skipped: 0, Time elapsed: 0.058 sec
Running org.apache.commons.chain.web.servlet.ServletSetLocaleCommandTestCase
Tests run: 2, Failures: 0, Errors: 0, Skipped: 0, Time elapsed: 0.003 sec
Running org.apache.commons.chain.web.portlet.PortletWebContextTestCase
Tests run: 18, Failures: 0, Errors: 0, Skipped: 0, Time elapsed: 0.056 sec
Running org.apache.commons.chain.web.portlet.PortletGetLocaleCommandTestCase
Tests run: 2, Failures: 0, Errors: 0, Skipped: 0, Time elapsed: 0.002 sec
Running org.apache.commons.chain.web.ChainResourcesTestCase
Tests run: 1, Failures: 0, Errors: 0, Skipped: 0, Time elapsed: 0.002 sec
Running org.apache.commons.chain.config.TestCommand
Tests run: 0, Failures: 0, Errors: 0, Skipped: 0, Time elapsed: 0 sec
Running org.apache.commons.chain.config.TestChain
Tests run: 0, Failures: 0, Errors: 0, Skipped: 0, Time elapsed: 0.001 sec
Running org.apache.commons.chain.config.ConfigParserTestCase
Tests run: 10, Failures: 1, Errors: 0, Skipped: 0, Time elapsed: 0.459
sec <<< FAILURE!
Running org.apache.commons.chain.config.ConfigParser2TestCase
Tests run: 10, Failures: 0, Errors: 0, Skipped: 0, Time elapsed: 0.181 sec
Running org.apache.commons.chain.generic.DispatchLookupCommandTestCase
Tests run: 3, Failures: 0, Errors: 0, Skipped: 0, Time elapsed: 0.006 sec
Running org.apache.commons.chain.generic.DispatchCommandTestCase
Tests run: 3, Failures: 0, Errors: 0, Skipped: 0, Time elapsed: 0.007 sec
Running org.apache.commons.chain.generic.LookupCommandTestCase
Tests run: 5, Failures: 0, Errors: 0, Skipped: 0, Time elapsed: 0.003 sec

Results :

Failed tests:
  testDefaut(org.apache.commons.chain.config.ConfigParserTestCase):
Correct command count expected:<17> but was:<19>

Tests run: 116, Failures: 1, Errors: 0, Skipped: 0

[INFO] ------------------------------------------------------------------------
[ERROR] BUILD FAILURE
[INFO] ------------------------------------------------------------------------
[INFO] There are test failures.

Please refer to /tmp/trunk/target/surefire-reports for the individual
test results.
[INFO] ------------------------------------------------------------------------
[INFO] For more information, run Maven with the -e switch
[INFO] ------------------------------------------------------------------------
[INFO] Total time: 4 minutes 8 seconds
[INFO] Finished at: Sun Jul 31 16:16:38 PDT 2011
[INFO] Final Memory: 54M/286M
[INFO] ------------------------------------------------------------------------


On Sun, Jul 31, 2011 at 10:05 AM, Simone Tripodi
<simonetripodi@apache.org> wrote:
> Hi Elijah,
> I'd investigate on Maven versions first as Phil suggested, before
> purging the local repo :P
> HTH, have a nice WE!
> Simo
>
> http://people.apache.org/~simonetripodi/
> http://www.99soft.org/
>
>
>
> On Sun, Jul 31, 2011 at 6:23 PM, David Karlsen <davidkarlsen@gmail.com> wrote:
>> Try nuking the local maven repository in case something is corrupt?
>> Den 31. juli 2011 17:07 skrev "Elijah Zupancic" <elijah@zupancic.name>
>> følgende:
>>> Here is the output from SVN diff:
>>>
>>> Index: pom.xml
>>> ===================================================================
>>> --- pom.xml (revision 1152492)
>>> +++ pom.xml (working copy)
>>> @@ -21,7 +21,7 @@
>>> <parent>
>>> <groupId>org.apache.commons</groupId>
>>> <artifactId>commons-parent</artifactId>
>>> - <version>15</version>
>>> + <version>21</version>
>>> </parent>
>>> <modelVersion>4.0.0</modelVersion>
>>> <groupId>commons-chain</groupId>
>>>
>>> I'm getting the same result with:
>>>
>>> OpenJDK Runtime Environment (IcedTea6 1.9.8) (6b20-1.9.8-0ubuntu1~10.10.1)
>>> OpenJDK 64-Bit Server VM (build 19.0-b09, mixed mode)
>>>
>>> AND
>>>
>>> java version "1.6.0_16"
>>> Java(TM) SE Runtime Environment (build 1.6.0_16-b01)
>>> Java HotSpot(TM) 64-Bit Server VM (build 14.2-b01, mixed mode)
>>>
>>> Also, I'm building against
>>> http://svn.apache.org/repos/asf/commons/proper/chain/trunk
>>>
>>> I'm on Ubuntu 10.10.
>>>
>>> I have manually the the digester version higher, and all tests passed.
>>> It is only when I upgrade the parent pom that this test fails. This is
>>> even more curious now that I hear it is working on your OS X system.
>>> When I get access to another machine, I will try it elsewhere next
>>> week. Right now, I'm out in the countryside with not a lot of
>>> resources.
>>>
>>> Thanks,
>>> -Elijah
>>>
>>> On Sun, Jul 31, 2011 at 12:16 AM, Phil Steitz <phil.steitz@gmail.com>
>> wrote:
>>>> On 7/30/11 11:13 AM, Elijah Zupancic wrote:
>>>>> As part of my refactoring project with Apache Chain, I've been trying
>>>>> to update dependency versions. I tried to upgrade the maven parent
>>>>> configuration and the compile worked fine, but I have been getting a
>>>>> really odd unit test failure. Moreover, I did a diff between maven
>>>>> parent pom.xml versions and nothing stood out to me as to why the
>>>>> parent pom would cause this.
>>>>
>>>> What OS and JDK are you using?  When I change the pom in trunk to
>>>> use commons-parent version 21 (with no other changes) all of the
>>>> tests run clean for me on OS X 10.7,
>>>> java version "1.6.0_26"
>>>> Java(TM) SE Runtime Environment (build 1.6.0_26-b03-383-11A511)
>>>> Java HotSpot(TM) 64-Bit Server VM (build 20.1-b02-383, mixed mode)
>>>>
>>>> Digester version in the pom in trunk is 1.8.  I also tested with 2.0
>>>> and 2.1 and did not see failures with JDK above.
>>>>
>>>> Are you sure there are no other changes in the sources you are
>>>> testing against?  Does svn diff turn up any other differences?
>>>>
>>>> Phil
>>>>>
>>>>> Results :
>>>>>
>>>>> Failed tests:
>>>>> testDefaut(org.apache.commons.chain.config.ConfigParserTestCase)  Time
>>>>> elapsed: 0.034 sec  <<< FAILURE!
>>>>> junit.framework.AssertionFailedError: Correct command count
>>>>> expected:<17> but was:<19>
>>>>>         at junit.framework.Assert.fail(Assert.java:47)
>>>>>         at junit.framework.Assert.failNotEquals(Assert.java:282)
>>>>>         at junit.framework.Assert.assertEquals(Assert.java:64)
>>>>>         at junit.framework.Assert.assertEquals(Assert.java:201)
>>>>>         at
>> org.apache.commons.chain.config.ConfigParserTestCase.checkCommandCount(ConfigParserTestCase.java:316)
>>>>>         at
>> org.apache.commons.chain.config.ConfigParserTestCase.testDefaut(ConfigParserTestCase.java:116)
>>>>>
>>>>>
>>>>> The XML file it is reading for commands contains exactly 17 commands,
>>>>> so the data source is correct. Before I start to peel apart the XML
>>>>> parser, I was wondering if anyone else encountered this before. Do any
>>>>> of you have any insight into this?
>>>>>
>>>>> Thanks,
>>>>> -Elijah
>>>>>
>>>>> ---------------------------------------------------------------------
>>>>> To unsubscribe, e-mail: dev-unsubscribe@commons.apache.org
>>>>> For additional commands, e-mail: dev-help@commons.apache.org
>>>>>
>>>>>
>>>>
>>>>
>>>> ---------------------------------------------------------------------
>>>> To unsubscribe, e-mail: dev-unsubscribe@commons.apache.org
>>>> For additional commands, e-mail: dev-help@commons.apache.org
>>>>
>>>>
>>>
>>> ---------------------------------------------------------------------
>>> To unsubscribe, e-mail: dev-unsubscribe@commons.apache.org
>>> For additional commands, e-mail: dev-help@commons.apache.org
>>>
>>
>
> ---------------------------------------------------------------------
> To unsubscribe, e-mail: dev-unsubscribe@commons.apache.org
> For additional commands, e-mail: dev-help@commons.apache.org
>
>

---------------------------------------------------------------------
To unsubscribe, e-mail: dev-unsubscribe@commons.apache.org
For additional commands, e-mail: dev-help@commons.apache.org


Mime
View raw message