commons-dev mailing list archives

Site index · List index
Message view « Date » · « Thread »
Top « Date » · « Thread »
From Gary Gregory <garydgreg...@gmail.com>
Subject [parent] Maven problems trying to RC commons-parent.
Date Tue, 12 Apr 2011 20:35:37 GMT
Hi All:

I'd like to RC [parent] to pick up the test jar changes.

I thought we had a special set of instructions to release [parent] compared
to Commons [components] but I cannot find the page anymore. I must have been
dreaming.

When I run:

mvn clean deploy -Prelease -Ptest-deploy

I get:

[INFO]
------------------------------------------------------------------------
[INFO] BUILD FAILURE
[INFO]
------------------------------------------------------------------------
[INFO] Total time: 3.887s
[INFO] Finished at: Tue Apr 12 16:27:26 EDT 2011
[INFO] Final Memory: 16M/219M
[INFO]
------------------------------------------------------------------------
[ERROR] Failed to execute goal
org.apache.maven.plugins:maven-assembly-plugin:2.2.1:single (default) on
project commons-parent: Error reading assemblies: No ass
embly descriptors found. -> [Help 1]
[ERROR]
[ERROR] To see the full stack trace of the errors, re-run Maven with the -e
switch.
[ERROR] Re-run Maven using the -X switch to enable full debug logging.
[ERROR]
[ERROR] For more information about the errors and possible solutions, please
read the following articles:
[ERROR] [Help 1]
http://cwiki.apache.org/confluence/display/MAVEN/MojoExecutionException

?

-- 
Thank you,
Gary

http://garygregory.wordpress.com/
http://garygregory.com/
http://people.apache.org/~ggregory/
http://twitter.com/GaryGregory

Mime
  • Unnamed multipart/alternative (inline, None, 0 bytes)
View raw message