commons-dev mailing list archives

Site index · List index
Message view « Date » · « Thread »
Top « Date » · « Thread »
From "Continuum@vmbuild" <contin...@apache.org>
Subject [continuum] BUILD FAILURE: Apache Commons - Commons Math - Default Maven 2 Build Definition (Java 1.5)
Date Mon, 11 Apr 2011 18:34:48 GMT
Online report : http://vmbuild.apache.org/continuum/buildResult.action?buildId=7184&projectId=97

Build statistics:
  State: Failed
  Previous State: Ok
  Started at: Mon 11 Apr 2011 18:32:53 +0000
  Finished at: Mon 11 Apr 2011 18:34:46 +0000
  Total time: 1m 53s
  Build Trigger: Schedule
  Build Number: 272
  Exit code: 1
  Building machine hostname: vmbuild
  Operating system : Linux(unknown)
  Java Home version : 
          java version "1.6.0_22"
          Java(TM) SE Runtime Environment (build 1.6.0_22-b04)
          Java HotSpot(TM) 64-Bit Server VM (build 17.1-b03, mixed mode)
        
  Builder version :
          Apache Maven 2.2.1 (r801777; 2009-08-06 19:16:01+0000)
          Java version: 1.6.0_22
          Java home: /usr/lib/jvm/java-6-sun-1.6.0.22/jre
          Default locale: en_US, platform encoding: ANSI_X3.4-1968
          OS name: "linux" version: "2.6.32-27-server" arch: "amd64" Family: "unix"
    
****************************************************************************
SCM Changes:
****************************************************************************
Changed: luc @ Mon 11 Apr 2011 17:43:40 +0000
Comment: replaced remaining getEpsilon by using ulps in double comparisons
Files changed:
  /commons/proper/math/trunk/src/main/java/org/apache/commons/math/optimization/linear/SimplexTableau.java
( 1091143 )
  /commons/proper/math/trunk/src/test/java/org/apache/commons/math/optimization/linear/SimplexSolverTest.java
( 1091143 )

Changed: luc @ Mon 11 Apr 2011 18:02:52 +0000
Comment: make sure the test runs correctly even in a non-US environment
Files changed:
  /commons/proper/math/trunk/src/test/java/org/apache/commons/math/exception/TooManyEvaluationsExceptionTest.java
( 1091153 )

****************************************************************************
Dependencies Changes:
****************************************************************************
No dependencies changed


****************************************************************************
Build Definition:
****************************************************************************
POM filename: pom.xml
Goals: clean install   
Arguments: --batch-mode -Pjava-1.5
Build Fresh: false
Always Build: false
Default Build Definition: true
Schedule: COMMONS_SCHEDULE
Profile Name: Maven 2.2.1
Description: Default Maven 2 Build Definition (Java 1.5)

****************************************************************************
Test Summary:
****************************************************************************
Tests: 2378
Failures: 1
Errors: 0
Success Rate: 99
Total time: 74.05902

****************************************************************************
Test Failures:
****************************************************************************

MathUtilsTest
    testCompareToMaxUlps :
  java.lang.AssertionError
  java.lang.AssertionError
	at org.apache.commons.math.util.MathUtils.equals(MathUtils.java:680)
	at org.apache.commons.math.util.MathUtils.compareTo(MathUtils.java:426)
	at org.apache.commons.math.util.MathUtilsTest.testCompareToMaxUlps(MathUtilsTest.java:332)
	at sun.reflect.NativeMethodAccessorImpl.invoke0(Native Method)
	at sun.reflect.NativeMethodAccessorImpl.invoke(NativeMethodAccessorImpl.java:39)
	at sun.reflect.DelegatingMethodAccessorImpl.invoke(DelegatingMethodAccessorImpl.java:25)
	at java.lang.reflect.Method.invoke(Method.java:592)
	at org.junit.runners.model.FrameworkMethod$1.runReflectiveCall(FrameworkMethod.java:44)
	at org.junit.internal.runners.model.ReflectiveCallable.run(ReflectiveCallable.java:15)
	at org.junit.runners.model.FrameworkMethod.invokeExplosively(FrameworkMethod.java:41)
	at org.junit.internal.runners.statements.InvokeMethod.evaluate(InvokeMethod.java:20)
	at org.junit.runners.BlockJUnit4ClassRunner.runNotIgnored(BlockJUnit4ClassRunner.java:79)
	at org.junit.runners.BlockJUnit4ClassRunner.runChild(BlockJUnit4ClassRunner.java:71)
	at org.junit.runners.BlockJUnit4ClassRunner.runChild(BlockJUnit4ClassRunner.java:49)
	at org.junit.runners.ParentRunner$3.run(ParentRunner.java:193)
	at org.junit.runners.ParentRunner$1.schedule(ParentRunner.java:52)
	at org.junit.runners.ParentRunner.runChildren(ParentRunner.java:191)
	at org.junit.runners.ParentRunner.access$000(ParentRunner.java:42)
	at org.junit.runners.ParentRunner$2.evaluate(ParentRunner.java:184)
	at org.junit.runners.ParentRunner.run(ParentRunner.java:236)
	at org.apache.maven.surefire.junit4.JUnit4TestSet.execute(JUnit4TestSet.java:35)
	at org.apache.maven.surefire.junit4.JUnit4Provider.executeTestSet(JUnit4Provider.java:115)
	at org.apache.maven.surefire.junit4.JUnit4Provider.invoke(JUnit4Provider.java:97)
	at sun.reflect.NativeMethodAccessorImpl.invoke0(Native Method)
	at sun.reflect.NativeMethodAccessorImpl.invoke(NativeMethodAccessorImpl.java:39)
	at sun.reflect.DelegatingMethodAccessorImpl.invoke(DelegatingMethodAccessorImpl.java:25)
	at java.lang.reflect.Method.invoke(Method.java:592)
	at org.apache.maven.surefire.booter.ProviderFactory$ClassLoaderProxy.invoke(ProviderFactory.java:103)
	at $Proxy0.invoke(Unknown Source)
	at org.apache.maven.surefire.booter.SurefireStarter.invokeProvider(SurefireStarter.java:150)
	at org.apache.maven.surefire.booter.SurefireStarter.runSuitesInProcess(SurefireStarter.java:91)
	at org.apache.maven.surefire.booter.ForkedBooter.main(ForkedBooter.java:69)

  



---------------------------------------------------------------------
To unsubscribe, e-mail: dev-unsubscribe@commons.apache.org
For additional commands, e-mail: dev-help@commons.apache.org


Mime
View raw message