commons-dev mailing list archives

Site index · List index
Message view « Date » · « Thread »
Top « Date » · « Thread »
From Gump <iss...@commons.apache.org>
Subject [GUMP@vmgump]: Project commons-vfs2 (in module apache-commons) failed
Date Fri, 11 Mar 2011 10:09:57 GMT
To whom it may engage...
        
This is an automated request, but not an unsolicited one. For 
more information please visit http://gump.apache.org/nagged.html, 
and/or contact the folk at general@gump.apache.org.

Project commons-vfs2 has an issue affecting its community integration.
This issue affects 7 projects,
 and has been outstanding for 15 runs.
The current state of this project is 'Failed', with reason 'Build Failed'.
For reference only, the following projects are affected by this:
    - commons-configuration :  Apache Commons
    - commons-configuration-test :  Apache Commons
    - commons-vfs2 :  Apache Commons
    - commons-vfs2-sandbox :  Apache Commons
    - commons-vfs2-test :  Apache Commons
    - jakarta-turbine-jcs :  Cache
    - jcs :  Cache


Full details are available at:
    http://vmgump.apache.org/gump/public/apache-commons/commons-vfs2/index.html

That said, some information snippets are provided here.

The following annotations (debug/informational/warning/error messages) were provided:
 -DEBUG- Sole jar output [commons-vfs2-*[0-9T].jar] identifier set to project name
 -INFO- Optional dependency doxia-site-renderer failed with reason build failed
 -DEBUG- (Apache Gump generated) Apache Maven Settings in: /srv/gump/public/workspace/apache-commons/vfs/gump_mvn_settings.xml
 -INFO- Failed with reason build failed
 -DEBUG- Maven POM in: /srv/gump/public/workspace/apache-commons/vfs/pom.xml
 -INFO- Failed to extract fallback artifacts from Gump Repository



The following work was performed:
http://vmgump.apache.org/gump/public/apache-commons/commons-vfs2/gump_work/build_apache-commons_commons-vfs2.html
Work Name: build_apache-commons_commons-vfs2 (Type: Build)
Work ended in a state of : Failed
Elapsed: 33 secs
Command Line: /opt/maven2/bin/mvn --batch-mode -DskipTests=true --settings /srv/gump/public/workspace/apache-commons/vfs/gump_mvn_settings.xml
package 
[Working Directory: /srv/gump/public/workspace/apache-commons/vfs]
M2_HOME: /opt/maven2
---------------------------------------------
[INFO] [antrun:run {execution: default}]
[INFO] Executing tasks
     [move] Moving 2 files to /srv/gump/public/workspace/apache-commons/vfs/core/target/test-classes/test-data/code
[INFO] Executed tasks
[WARNING] DEPRECATED [systemProperties]: Use systemPropertyVariables instead.
[INFO] [surefire:test {execution: default-test}]
[INFO] Tests are skipped.
[INFO] [jar:jar {execution: default-jar}]
[INFO] Building jar: /srv/gump/public/workspace/apache-commons/vfs/core/target/commons-vfs2-2.0-SNAPSHOT.jar
[INFO] [jar:test-jar {execution: default}]
[INFO] Building jar: /srv/gump/public/workspace/apache-commons/vfs/core/target/commons-vfs2-2.0-SNAPSHOT-tests.jar
[INFO] ------------------------------------------------------------------------
[INFO] Building Commons VFS Examples
[INFO]    task-segment: [package]
[INFO] ------------------------------------------------------------------------
[INFO] [antrun:run {execution: javadoc.resources}]
[INFO] Executing tasks
[INFO] Executed tasks
[INFO] [remote-resources:process {execution: default}]
[INFO] [resources:resources {execution: default-resources}]
[INFO] Using 'UTF-8' encoding to copy filtered resources.
[INFO] Copying 1 resource to META-INF
[INFO] Copying 1 resource to META-INF
[INFO] [compiler:compile {execution: default-compile}]
[INFO] Compiling 5 source files to /srv/gump/public/workspace/apache-commons/vfs/examples/target/classes
[INFO] -------------------------------------------------------------
[ERROR] COMPILATION ERROR : 
[INFO] -------------------------------------------------------------
[ERROR] /srv/gump/public/workspace/apache-commons/vfs/examples/src/main/java/org/apache/commons/vfs2/libcheck/FtpCheck.java:[75,46]
cannot find symbol
symbol  : method getSystemName()
location: class org.apache.commons.net.ftp.FTPClient

[INFO] 1error
[INFO] -------------------------------------------------------------
[INFO] ------------------------------------------------------------------------
[ERROR] BUILD FAILURE
[INFO] ------------------------------------------------------------------------
[INFO] Compilation failure
/srv/gump/public/workspace/apache-commons/vfs/examples/src/main/java/org/apache/commons/vfs2/libcheck/FtpCheck.java:[75,46]
cannot find symbol
symbol  : method getSystemName()
location: class org.apache.commons.net.ftp.FTPClient


[INFO] ------------------------------------------------------------------------
[INFO] For more information, run Maven with the -e switch
[INFO] ------------------------------------------------------------------------
[INFO] Total time: 32 seconds
[INFO] Finished at: Fri Mar 11 10:09:56 UTC 2011
[INFO] Final Memory: 46M/110M
[INFO] ------------------------------------------------------------------------
---------------------------------------------

To subscribe to this information via syndicated feeds:
- RSS: http://vmgump.apache.org/gump/public/apache-commons/commons-vfs2/rss.xml
- Atom: http://vmgump.apache.org/gump/public/apache-commons/commons-vfs2/atom.xml

============================== Gump Tracking Only ===
Produced by Apache Gump(TM) version 2.3.
Gump Run 04000611032011, vmgump.apache.org:vmgump:04000611032011
Gump E-mail Identifier (unique within run) #14.

--
Apache Gump
http://gump.apache.org/ [Instance: vmgump]

---------------------------------------------------------------------
To unsubscribe, e-mail: dev-unsubscribe@commons.apache.org
For additional commands, e-mail: dev-help@commons.apache.org


Mime
View raw message