commons-dev mailing list archives

Site index · List index
Message view « Date » · « Thread »
Top « Date » · « Thread »
From Gump <iss...@commons.apache.org>
Subject [GUMP@vmgump]: Project commons-vfs (in module commons-vfs-1.x) failed
Date Fri, 04 Mar 2011 09:52:39 GMT
To whom it may engage...
        
This is an automated request, but not an unsolicited one. For 
more information please visit http://gump.apache.org/nagged.html, 
and/or contact the folk at general@gump.apache.org.

Project commons-vfs has an issue affecting its community integration.
This issue affects 30 projects,
 and has been outstanding for 2 runs.
The current state of this project is 'Failed', with reason 'Build Failed'.
For reference only, the following projects are affected by this:
    - ant-contrib :  Useful little Ant tasks
    - ant-contrib-test :  Useful little Ant tasks
    - antbook-diary-core :  Examples to go with Java Development with Ant
    - antbook-sections :  Examples to go with Java Development with Ant
    - antbook-sections-tasks :  Examples to go with Java Development with Ant
    - cddlm :  Configuration and Deployment of Grid Applications and System...
    - commons-vfs :  Apache Commons VFS 1.x
    - commons-vfs-sandbox :  Apache Commons VFS 1.x
    - commons-vfs-test :  Apache Commons VFS 1.x
    - commons-vfs2-sandbox :  Apache Commons
    - forrest-core :  Apache Forrest software is a publishing framework that trans...
    - forrest-rat :  Apache Forrest software is a publishing framework that trans...
    - forrest-test :  Apache Forrest software is a publishing framework that trans...
    - forrest-test-basic :  Apache Forrest software is a publishing framework that trans...
    - invicta :  Open-source build management tool.
    - ivy :  Apache Ivy is a tool for managing (recording, tracking, reso...
    - ivy-tests :  Apache Ivy is a tool for managing (recording, tracking, reso...
    - jakarta-turbine-jcs :  Cache
    - jcs :  Cache
    - jgroups :  A Reliable Multicast Communication Toolkit for Java
    - logging-log4j-chainsaw :  Chainsaw log viewer
    - org.apache.commons_commons-vfs :  Apache Commons VFS 1.x
    - smartfrog :  Smartfrog: Application Deployment from HP Laboratories
    - smartfrog-components :  Smartfrog: Application Deployment from HP Laboratories
    - smartfrog-tasks :  Smartfrog: Application Deployment from HP Laboratories
    - smartfrog-tasks-test :  Smartfrog: Application Deployment from HP Laboratories
    - smartfrog-test :  Smartfrog: Application Deployment from HP Laboratories
    - smartfrog-testharness :  Smartfrog: Application Deployment from HP Laboratories
    - testng :  Java Unit test framework
    - testng-deps :  Java Unit test framework


Full details are available at:
    http://vmgump.apache.org/gump/public/commons-vfs-1.x/commons-vfs/index.html

That said, some information snippets are provided here.

The following annotations (debug/informational/warning/error messages) were provided:
 -DEBUG- Sole jar output [commons-vfs-*[0-9T].jar] identifier set to project name
 -INFO- Optional dependency doxia-site-renderer failed with reason build failed
 -DEBUG- (Apache Gump generated) Apache Maven Settings in: /srv/gump/public/workspace/commons-vfs-1.x/gump_mvn_settings.xml
 -INFO- Failed with reason build failed
 -DEBUG- Maven POM in: /srv/gump/public/workspace/commons-vfs-1.x/pom.xml
 -DEBUG- Extracted fallback artifacts from Gump Repository



The following work was performed:
http://vmgump.apache.org/gump/public/commons-vfs-1.x/commons-vfs/gump_work/build_commons-vfs-1.x_commons-vfs.html
Work Name: build_commons-vfs-1.x_commons-vfs (Type: Build)
Work ended in a state of : Failed
Elapsed: 33 secs
Command Line: /opt/maven2/bin/mvn --batch-mode -DskipTests=true --settings /srv/gump/public/workspace/commons-vfs-1.x/gump_mvn_settings.xml
package 
[Working Directory: /srv/gump/public/workspace/commons-vfs-1.x]
M2_HOME: /opt/maven2
---------------------------------------------
[INFO] [antrun:run {execution: default}]
[INFO] Executing tasks
     [move] Moving 2 files to /srv/gump/public/workspace/commons-vfs-1.x/core/target/test-classes/test-data/code
[INFO] Executed tasks
[WARNING] DEPRECATED [systemProperties]: Use systemPropertyVariables instead.
[INFO] [surefire:test {execution: default-test}]
[INFO] Tests are skipped.
[INFO] [jar:jar {execution: default-jar}]
[INFO] Building jar: /srv/gump/public/workspace/commons-vfs-1.x/core/target/commons-vfs-2.1-SNAPSHOT.jar
[INFO] [jar:test-jar {execution: default}]
[INFO] Building jar: /srv/gump/public/workspace/commons-vfs-1.x/core/target/commons-vfs-2.1-SNAPSHOT-tests.jar
[INFO] ------------------------------------------------------------------------
[INFO] Building Commons VFS Examples
[INFO]    task-segment: [package]
[INFO] ------------------------------------------------------------------------
[INFO] [antrun:run {execution: javadoc.resources}]
[INFO] Executing tasks
[INFO] Executed tasks
[INFO] [remote-resources:process {execution: default}]
[INFO] [resources:resources {execution: default-resources}]
[INFO] Using 'UTF-8' encoding to copy filtered resources.
[INFO] Copying 1 resource to META-INF
[INFO] Copying 1 resource to META-INF
[INFO] [compiler:compile {execution: default-compile}]
[INFO] Compiling 5 source files to /srv/gump/public/workspace/commons-vfs-1.x/examples/target/classes
[INFO] -------------------------------------------------------------
[ERROR] COMPILATION ERROR : 
[INFO] -------------------------------------------------------------
[ERROR] /srv/gump/public/workspace/commons-vfs-1.x/examples/src/main/java/org/apache/commons/vfs/libcheck/FtpCheck.java:[75,46]
cannot find symbol
symbol  : method getSystemName()
location: class org.apache.commons.net.ftp.FTPClient

[INFO] 1error
[INFO] -------------------------------------------------------------
[INFO] ------------------------------------------------------------------------
[ERROR] BUILD FAILURE
[INFO] ------------------------------------------------------------------------
[INFO] Compilation failure
/srv/gump/public/workspace/commons-vfs-1.x/examples/src/main/java/org/apache/commons/vfs/libcheck/FtpCheck.java:[75,46]
cannot find symbol
symbol  : method getSystemName()
location: class org.apache.commons.net.ftp.FTPClient


[INFO] ------------------------------------------------------------------------
[INFO] For more information, run Maven with the -e switch
[INFO] ------------------------------------------------------------------------
[INFO] Total time: 32 seconds
[INFO] Finished at: Fri Mar 04 09:52:38 UTC 2011
[INFO] Final Memory: 47M/113M
[INFO] ------------------------------------------------------------------------
---------------------------------------------

To subscribe to this information via syndicated feeds:
- RSS: http://vmgump.apache.org/gump/public/commons-vfs-1.x/commons-vfs/rss.xml
- Atom: http://vmgump.apache.org/gump/public/commons-vfs-1.x/commons-vfs/atom.xml

============================== Gump Tracking Only ===
Produced by Apache Gump(TM) version 2.3.
Gump Run 05000604032011, vmgump.apache.org:vmgump:05000604032011
Gump E-mail Identifier (unique within run) #18.

--
Apache Gump
http://gump.apache.org/ [Instance: vmgump]

---------------------------------------------------------------------
To unsubscribe, e-mail: dev-unsubscribe@commons.apache.org
For additional commands, e-mail: dev-help@commons.apache.org


Mime
View raw message