commons-dev mailing list archives

Site index · List index
Message view « Date » · « Thread »
Top « Date » · « Thread »
From Gump <iss...@commons.apache.org>
Subject [GUMP@vmgump]: Project commons-sanselan-test (in module apache-commons) failed
Date Mon, 27 Dec 2010 05:39:22 GMT
To whom it may engage...
        
This is an automated request, but not an unsolicited one. For 
more information please visit http://gump.apache.org/nagged.html, 
and/or contact the folk at general@gump.apache.org.

Project commons-sanselan-test has an issue affecting its community integration.
This issue affects 1 projects,
 and has been outstanding for 2 runs.
The current state of this project is 'Failed', with reason 'Build Failed'.
For reference only, the following projects are affected by this:
    - commons-sanselan-test :  Apache Commons


Full details are available at:
    http://vmgump.apache.org/gump/public/apache-commons/commons-sanselan-test/index.html

That said, some information snippets are provided here.

The following annotations (debug/informational/warning/error messages) were provided:
 -WARNING- Overriding Maven settings: [/srv/gump/public/workspace/apache-commons/sanselan/gump_mvn_settings.xml]
 -DEBUG- (Apache Gump generated) Apache Maven Settings in: /srv/gump/public/workspace/apache-commons/sanselan/gump_mvn_settings.xml
 -INFO- Failed with reason build failed
 -DEBUG- Maven POM in: /srv/gump/public/workspace/apache-commons/sanselan/pom.xml
 -INFO- Project Reports in: /srv/gump/public/workspace/apache-commons/sanselan/target/surefire-reports



The following work was performed:
http://vmgump.apache.org/gump/public/apache-commons/commons-sanselan-test/gump_work/build_apache-commons_commons-sanselan-test.html
Work Name: build_apache-commons_commons-sanselan-test (Type: Build)
Work ended in a state of : Failed
Elapsed: 2 mins 20 secs
Command Line: /opt/maven2/bin/mvn --batch-mode --settings /srv/gump/public/workspace/apache-commons/sanselan/gump_mvn_settings.xml
test 
[Working Directory: /srv/gump/public/workspace/apache-commons/sanselan]
M2_HOME: /opt/maven2
---------------------------------------------
tempFile: tmp/testImageNoAlpha.png.4.8326533542968809123.png
tempFile: tmp/testImageNoAlpha.png.5.8443506848554254254.png
tempFile: tmp/testImageNoAlpha.png.6.5423742584298042864.png
tempFile: tmp/testImageNoAlpha.png.7.7529446501874351431.png
tempFile: tmp/testImageNoAlpha.png.8.4722369259454509445.png
tempFile: tmp/testImageNoAlpha.png.9.6563196598950827659.png

imageFile: src/test/data/images/png/3/testImage.png
tempFile: tmp/testImage.png.0.2144950946836262775.png
tempFile: tmp/testImage.png.1.6991958647810992955.png
tempFile: tmp/testImage.png.2.5983134366934006366.png
tempFile: tmp/testImage.png.3.6583888090461456807.png
tempFile: tmp/testImage.png.4.7466919977597437088.png
tempFile: tmp/testImage.png.5.7231681637727393798.png
tempFile: tmp/testImage.png.6.6982129639321868672.png
tempFile: tmp/testImage.png.7.8052753002290396307.png
tempFile: tmp/testImage.png.8.5814554169838716516.png
Tests run: 1, Failures: 0, Errors: 1, Skipped: 0, Time elapsed: 1.556 sec <<< FAILURE!
Running org.apache.sanselan.formats.gif.GifReadTest
start
imageFile: /srv/gump/public/workspace/apache-commons/sanselan/src/test/data/images/gif/1/Oregon
Scientific DS6639 - DSC_0307 - small.gif
imageFile: /srv/gump/public/workspace/apache-commons/sanselan/src/test/data/images/gif/2/test.gif
Tests run: 1, Failures: 0, Errors: 0, Skipped: 0, Time elapsed: 0.844 sec
Running org.apache.sanselan.roundtrip.RoundtripTest
bitmap test: PNG
bitmap test: GIF
bitmap test: ICO
bitmap test: TIFF
bitmap test: BMP
grayscale test: PNG
indexable test: PNG
fullColor test: PNG
Tests run: 4, Failures: 1, Errors: 3, Skipped: 0, Time elapsed: 6.543 sec <<< FAILURE!
org.apache.maven.surefire.booter.SurefireExecutionException: Unable to create file for report:
/srv/gump/public/workspace/apache-commons/sanselan/target/surefire-reports/org.apache.sanselan.formats.xmp.XmpUpdateTest.txt
(No space left on device); nested exception is java.io.FileNotFoundException: /srv/gump/public/workspace/apache-commons/sanselan/target/surefire-reports/org.apache.sanselan.formats.xmp.XmpUpdateTest.txt
(No space left on device); nested exception is org.apache.maven.surefire.report.ReporterException:
Unable to create file for report: /srv/gump/public/workspace/apache-commons/sanselan/target/surefire-reports/org.apache.sanselan.formats.xmp.XmpUpdateTest.txt
(No space left on device); nested exception is java.io.FileNotFoundException: /srv/gump/public/workspace/apache-commons/sanselan/target/surefire-reports/org.apache.sanselan.formats.xmp.XmpUpdateTest.txt
(No space left on device)
org.apache.maven.surefire.report.ReporterException: Unable to create file for report: /srv/gump/public/workspace/apache-commons/sanselan/target/surefire-reports/org.apache.sanselan.formats.xmp.XmpUpdateTest.txt
(No space left on device); nested exception is java.io.FileNotFoundException: /srv/gump/public/workspace/apache-commons/sanselan/target/surefire-reports/org.apache.sanselan.formats.xmp.XmpUpdateTest.txt
(No space left on device)
java.io.FileNotFoundException: /srv/gump/public/workspace/apa	at java.io.FileOutputStream.open(Native
Method)
	at java.io.FileOutputStream.<init>(FileOutputStream.java:209)
[INFO] ------------------------------------------------------------------------
[ERROR] BUILD FAILURE
[INFO] ------------------------------------------------------------------------
[INFO] There are test failures.

Please refer to /srv/gump/public/workspace/apache-commons/sanselan/target/surefire-reports
for the individual test results.
[INFO] ------------------------------------------------------------------------
[INFO] For more information, run Maven with the -e switch
[INFO] ------------------------------------------------------------------------
[INFO] Total time: 2 minutes 19 seconds
[INFO] Finished at: Mon Dec 27 05:39:16 UTC 2010
[INFO] Final Memory: 42M/101M
[INFO] ------------------------------------------------------------------------
---------------------------------------------

To subscribe to this information via syndicated feeds:
- RSS: http://vmgump.apache.org/gump/public/apache-commons/commons-sanselan-test/rss.xml
- Atom: http://vmgump.apache.org/gump/public/apache-commons/commons-sanselan-test/atom.xml

============================== Gump Tracking Only ===
Produced by Apache Gump(TM) version 2.3.
Gump Run 23000027122010, vmgump.apache.org:vmgump:23000027122010
Gump E-mail Identifier (unique within run) #7.

--
Apache Gump
http://gump.apache.org/ [Instance: vmgump]

---------------------------------------------------------------------
To unsubscribe, e-mail: dev-unsubscribe@commons.apache.org
For additional commands, e-mail: dev-help@commons.apache.org


Mime
View raw message