commons-dev mailing list archives

Site index · List index
Message view « Date » · « Thread »
Top « Date » · « Thread »
From Gump <iss...@commons.apache.org>
Subject [GUMP@vmgump]: Project commons-scxml-test (in module apache-commons) failed
Date Fri, 03 Dec 2010 02:41:38 GMT
To whom it may engage...
        
This is an automated request, but not an unsolicited one. For 
more information please visit http://gump.apache.org/nagged.html, 
and/or contact the folk at general@gump.apache.org.

Project commons-scxml-test has an issue affecting its community integration.
This issue affects 1 projects.
The current state of this project is 'Failed', with reason 'Build Failed'.
For reference only, the following projects are affected by this:
    - commons-scxml-test :  Apache Commons


Full details are available at:
    http://vmgump.apache.org/gump/public/apache-commons/commons-scxml-test/index.html

That said, some information snippets are provided here.

The following annotations (debug/informational/warning/error messages) were provided:
 -WARNING- Overriding Maven settings: [/srv/gump/public/workspace/apache-commons/scxml/gump_mvn_settings.xml]
 -DEBUG- (Apache Gump generated) Apache Maven Settings in: /srv/gump/public/workspace/apache-commons/scxml/gump_mvn_settings.xml
 -INFO- Failed with reason build failed
 -DEBUG- Maven POM in: /srv/gump/public/workspace/apache-commons/scxml/pom.xml
 -INFO- Project Reports in: /srv/gump/public/workspace/apache-commons/scxml/target/surefire-reports



The following work was performed:
http://vmgump.apache.org/gump/public/apache-commons/commons-scxml-test/gump_work/build_apache-commons_commons-scxml-test.html
Work Name: build_apache-commons_commons-scxml-test (Type: Build)
Work ended in a state of : Failed
Elapsed: 21 secs
Command Line: /opt/maven2/bin/mvn --batch-mode --settings /srv/gump/public/workspace/apache-commons/scxml/gump_mvn_settings.xml
test 
[Working Directory: /srv/gump/public/workspace/apache-commons/scxml]
M2_HOME: /opt/maven2
---------------------------------------------

-------------------------------------------------------
 T E S T S
-------------------------------------------------------
Running org.apache.commons.scxml.invoke.InvokeTestSuite
Tests run: 6, Failures: 0, Errors: 0, Skipped: 0, Time elapsed: 2.928 sec
Running org.apache.commons.scxml.test.TestingTestSuite
Tests run: 0, Failures: 0, Errors: 0, Skipped: 0, Time elapsed: 0.017 sec
Running org.apache.commons.scxml.env.EnvTestSuite
Tests run: 21, Failures: 0, Errors: 0, Skipped: 0, Time elapsed: 0.15 sec
Running org.apache.commons.scxml.SCXMLTestSuite
Tests run: 71, Failures: 1, Errors: 0, Skipped: 0, Time elapsed: 3.3 sec <<< FAILURE!
Running org.apache.commons.scxml.issues.IssuesTestSuite
Tests run: 5, Failures: 0, Errors: 0, Skipped: 0, Time elapsed: 0.433 sec
Running org.apache.commons.scxml.model.ModelTestSuite
Tests run: 78, Failures: 1, Errors: 0, Skipped: 0, Time elapsed: 2.91 sec <<< FAILURE!
Running org.apache.commons.scxml.env.faces.EnvFacesTestSuite
Tests run: 1, Failures: 0, Errors: 0, Skipped: 0, Time elapsed: 0.005 sec
Running org.apache.commons.scxml.semantics.SemanticsTestSuite
Tests run: 6, Failures: 0, Errors: 0, Skipped: 0, Time elapsed: 0.004 sec
Running org.apache.commons.scxml.env.jsp.EnvJspTestSuite
Tests run: 3, Failures: 0, Errors: 0, Skipped: 0, Time elapsed: 0.038 sec
Running org.apache.commons.scxml.env.jexl.EnvJexlTestSuite
Tests run: 6, Failures: 0, Errors: 0, Skipped: 0, Time elapsed: 0.023 sec
Running org.apache.commons.scxml.env.servlet.EnvServletTestSuite
Tests run: 1, Failures: 0, Errors: 0, Skipped: 0, Time elapsed: 0.003 sec
Running org.apache.commons.scxml.io.IOTestSuite
Tests run: 30, Failures: 0, Errors: 0, Skipped: 0, Time elapsed: 0.417 sec

Results :

Failed tests: 
  testNamespacePrefixedXPathsEL(org.apache.commons.scxml.NamespacePrefixedXPathsTest)
  testDatamodelSimultaneousJsp(org.apache.commons.scxml.model.DatamodelTest)

Tests run: 228, Failures: 2, Errors: 0, Skipped: 0

[INFO] ------------------------------------------------------------------------
[ERROR] BUILD FAILURE
[INFO] ------------------------------------------------------------------------
[INFO] There are test failures.

Please refer to /srv/gump/public/workspace/apache-commons/scxml/target/surefire-reports for
the individual test results.
[INFO] ------------------------------------------------------------------------
[INFO] For more information, run Maven with the -e switch
[INFO] ------------------------------------------------------------------------
[INFO] Total time: 20 seconds
[INFO] Finished at: Fri Dec 03 02:41:37 UTC 2010
[INFO] Final Memory: 41M/100M
[INFO] ------------------------------------------------------------------------
---------------------------------------------

To subscribe to this information via syndicated feeds:
- RSS: http://vmgump.apache.org/gump/public/apache-commons/commons-scxml-test/rss.xml
- Atom: http://vmgump.apache.org/gump/public/apache-commons/commons-scxml-test/atom.xml

============================== Gump Tracking Only ===
Produced by Apache Gump(TM) version 2.3.
Gump Run 10011802122010, vmgump.apache.org:vmgump:10011802122010
Gump E-mail Identifier (unique within run) #6.

--
Apache Gump
http://gump.apache.org/ [Instance: vmgump]

---------------------------------------------------------------------
To unsubscribe, e-mail: dev-unsubscribe@commons.apache.org
For additional commands, e-mail: dev-help@commons.apache.org


Mime
View raw message