commons-dev mailing list archives

Site index · List index
Message view « Date » · « Thread »
Top « Date » · « Thread »
From Stefan Bodewig <bode...@apache.org>
Subject [GUMP@vmgump]: Project commons-jci-fam (in module apache-commons) failed
Date Wed, 03 Nov 2010 16:12:30 GMT
To whom it may engage...
        
This is an automated request, but not an unsolicited one. For 
more information please visit http://gump.apache.org/nagged.html, 
and/or contact the folk at general@gump.apache.org.

Project commons-jci-fam has an issue affecting its community integration.
This issue affects 2 projects,
 and has been outstanding for 133 runs.
The current state of this project is 'Failed', with reason 'Build Failed'.
For reference only, the following projects are affected by this:
    - commons-jci-fam :  Apache Commons
    - commons-jci-reactor :  Apache Commons


Full details are available at:
    http://vmgump.apache.org/gump/public/apache-commons/commons-jci-fam/index.html

That said, some information snippets are provided here.

The following annotations (debug/informational/warning/error messages) were provided:
 -DEBUG- Sole jar output [commons-jci-fam-*[0-9T].jar] identifier set to project name
 -DEBUG- (Gump generated) Maven Settings in: /srv/gump/public/workspace/apache-commons/jci/fam/gump_mvn_settings.xml
 -INFO- Failed with reason build failed
 -DEBUG- Maven POM in: /srv/gump/public/workspace/apache-commons/jci/fam/pom.xml
 -DEBUG- Extracted fallback artifacts from Gump Repository



The following work was performed:
http://vmgump.apache.org/gump/public/apache-commons/commons-jci-fam/gump_work/build_apache-commons_commons-jci-fam.html
Work Name: build_apache-commons_commons-jci-fam (Type: Build)
Work ended in a state of : Failed
Elapsed: 2 mins 4 secs
Command Line: /opt/maven2/bin/mvn --batch-mode --settings /srv/gump/public/workspace/apache-commons/jci/fam/gump_mvn_settings.xml
package 
[Working Directory: /srv/gump/public/workspace/apache-commons/jci/fam]
M2_HOME: /opt/maven2
---------------------------------------------
[INFO] Executed tasks
[INFO] Setting property: classpath.resource.loader.class => 'org.codehaus.plexus.velocity.ContextClassLoaderResourceLoader'.
[INFO] Setting property: velocimacro.messages.on => 'false'.
[INFO] Setting property: resource.loader => 'classpath'.
[INFO] Setting property: resource.manager.logwhenfound => 'false'.
[INFO] [remote-resources:process {execution: default}]
[INFO] [resources:resources {execution: default-resources}]
[INFO] Using 'iso-8859-1' encoding to copy filtered resources.
[INFO] Copying 0 resource to META-INF
[INFO] [compiler:compile {execution: default-compile}]
[INFO] Compiling 5 source files to /srv/gump/public/workspace/apache-commons/jci/fam/target/classes
[INFO] [bundle:manifest {execution: bundle-manifest}]
[INFO] [resources:testResources {execution: default-testResources}]
[INFO] Using 'iso-8859-1' encoding to copy filtered resources.
[INFO] Copying 1 resource
[INFO] [compiler:testCompile {execution: default-testCompile}]
[INFO] Compiling 1 source file to /srv/gump/public/workspace/apache-commons/jci/fam/target/test-classes
[INFO] [surefire:test {execution: default-test}]
[INFO] Surefire report directory: /srv/gump/public/workspace/apache-commons/jci/fam/target/surefire-reports

-------------------------------------------------------
 T E S T S
-------------------------------------------------------
Running org.apache.commons.jci.monitor.FilesystemAlterationMonitorTestCase
2010/11/03 16:10:54:733 UTC [ERROR] AbstractFilesystemAlterationListener - timeout after 10s
2010/11/03 16:11:19:571 UTC [ERROR] AbstractFilesystemAlterationListener - timeout after 10s
2010/11/03 16:11:30:579 UTC [ERROR] AbstractFilesystemAlterationListener - timeout after 10s
2010/11/03 16:11:42:585 UTC [ERROR] AbstractFilesystemAlterationListener - timeout after 10s
Tests run: 13, Failures: 0, Errors: 1, Skipped: 0, Time elapsed: 104.553 sec <<<
FAILURE!

Results :

Tests in error: 
  testCreateFileDetection(org.apache.commons.jci.monitor.FilesystemAlterationMonitorTestCase)

Tests run: 13, Failures: 0, Errors: 1, Skipped: 0

[INFO] ------------------------------------------------------------------------
[ERROR] BUILD FAILURE
[INFO] ------------------------------------------------------------------------
[INFO] There are test failures.

Please refer to /srv/gump/public/workspace/apache-commons/jci/fam/target/surefire-reports
for the individual test results.
[INFO] ------------------------------------------------------------------------
[INFO] For more information, run Maven with the -e switch
[INFO] ------------------------------------------------------------------------
[INFO] Total time: 2 minutes 3 seconds
[INFO] Finished at: Wed Nov 03 16:12:27 UTC 2010
[INFO] Final Memory: 48M/116M
[INFO] ------------------------------------------------------------------------
---------------------------------------------

To subscribe to this information via syndicated feeds:
- RSS: http://vmgump.apache.org/gump/public/apache-commons/commons-jci-fam/rss.xml
- Atom: http://vmgump.apache.org/gump/public/apache-commons/commons-jci-fam/atom.xml

============================== Gump Tracking Only ===
Produced by Gump version 2.3.
Gump Run 16010603112010, vmgump.apache.org:vmgump:16010603112010
Gump E-mail Identifier (unique within run) #13.

--
Apache Gump
http://gump.apache.org/ [Instance: vmgump]

---------------------------------------------------------------------
To unsubscribe, e-mail: dev-unsubscribe@commons.apache.org
For additional commands, e-mail: dev-help@commons.apache.org


Mime
View raw message