commons-dev mailing list archives

Site index · List index
Message view « Date » · « Thread »
Top « Date » · « Thread »
From Stefan Bodewig <bode...@apache.org>
Subject [GUMP@vmgump]: Project commons-jci-core (in module apache-commons) failed
Date Sun, 31 Oct 2010 09:14:00 GMT
To whom it may engage...
        
This is an automated request, but not an unsolicited one. For 
more information please visit http://gump.apache.org/nagged.html, 
and/or contact the folk at general@gump.apache.org.

Project commons-jci-core has an issue affecting its community integration.
This issue affects 2 projects,
 and has been outstanding for 129 runs.
The current state of this project is 'Failed', with reason 'Build Failed'.
For reference only, the following projects are affected by this:
    - commons-jci-core :  Apache Commons
    - commons-jci-reactor :  Apache Commons


Full details are available at:
    http://vmgump.apache.org/gump/public/apache-commons/commons-jci-core/index.html

That said, some information snippets are provided here.

The following annotations (debug/informational/warning/error messages) were provided:
 -DEBUG- Sole jar output [commons-jci-core-*[0-9T].jar] identifier set to project name
 -DEBUG- (Gump generated) Maven2 Settings in: /srv/gump/public/workspace/apache-commons/jci/core/gump_mvn_settings.xml
 -INFO- Failed with reason build failed
 -DEBUG- Maven POM in: /srv/gump/public/workspace/apache-commons/jci/core/pom.xml
 -INFO- Failed to extract fallback artifacts from Gump Repository



The following work was performed:
http://vmgump.apache.org/gump/public/apache-commons/commons-jci-core/gump_work/build_apache-commons_commons-jci-core.html
Work Name: build_apache-commons_commons-jci-core (Type: Build)
Work ended in a state of : Failed
Elapsed: 1 min 38 secs
Command Line: mvn --batch-mode --settings /srv/gump/public/workspace/apache-commons/jci/core/gump_mvn_settings.xml
package 
[Working Directory: /srv/gump/public/workspace/apache-commons/jci/core]
---------------------------------------------
[INFO] [remote-resources:process {execution: default}]
[INFO] [resources:resources {execution: default-resources}]
[INFO] Using 'iso-8859-1' encoding to copy filtered resources.
[INFO] Copying 0 resource to META-INF
[INFO] [compiler:compile {execution: default-compile}]
[INFO] Compiling 22 source files to /srv/gump/public/workspace/apache-commons/jci/core/target/classes
[INFO] [bundle:manifest {execution: bundle-manifest}]
[INFO] [resources:testResources {execution: default-testResources}]
[INFO] Using 'iso-8859-1' encoding to copy filtered resources.
[INFO] Copying 1 resource
[INFO] [compiler:testCompile {execution: default-testCompile}]
[INFO] Compiling 9 source files to /srv/gump/public/workspace/apache-commons/jci/core/target/test-classes
[INFO] [surefire:test {execution: default-test}]
[INFO] Surefire report directory: /srv/gump/public/workspace/apache-commons/jci/core/target/surefire-reports

-------------------------------------------------------
 T E S T S
-------------------------------------------------------
Running org.apache.commons.jci.CompilingClassLoaderTestCase
2010/10/31 09:12:43:314 UTC [ERROR] AbstractFilesystemAlterationListener - timeout after 10s
Tests run: 4, Failures: 0, Errors: 1, Skipped: 0, Time elapsed: 47.342 sec <<< FAILURE!
Running org.apache.commons.jci.ReloadingClassLoaderRemoveTestCase
Tests run: 7, Failures: 0, Errors: 0, Skipped: 0, Time elapsed: 0.03 sec
Running org.apache.commons.jci.ReloadingClassLoaderTestCase
Tests run: 6, Failures: 0, Errors: 0, Skipped: 0, Time elapsed: 33.051 sec
Running org.apache.commons.jci.stores.ResourceStoreTestCase
Tests run: 3, Failures: 0, Errors: 0, Skipped: 0, Time elapsed: 1.466 sec
Running org.apache.commons.jci.readers.ResourceReaderTestCase
Tests run: 2, Failures: 0, Errors: 0, Skipped: 0, Time elapsed: 0.028 sec

Results :

Tests in error: 
  testCreate(org.apache.commons.jci.CompilingClassLoaderTestCase)

Tests run: 22, Failures: 0, Errors: 1, Skipped: 0

[INFO] ------------------------------------------------------------------------
[ERROR] BUILD FAILURE
[INFO] ------------------------------------------------------------------------
[INFO] There are test failures.

Please refer to /srv/gump/public/workspace/apache-commons/jci/core/target/surefire-reports
for the individual test results.
[INFO] ------------------------------------------------------------------------
[INFO] For more information, run Maven with the -e switch
[INFO] ------------------------------------------------------------------------
[INFO] Total time: 1 minute 36 seconds
[INFO] Finished at: Sun Oct 31 09:13:54 UTC 2010
[INFO] Final Memory: 48M/116M
[INFO] ------------------------------------------------------------------------
---------------------------------------------

To subscribe to this information via syndicated feeds:
- RSS: http://vmgump.apache.org/gump/public/apache-commons/commons-jci-core/rss.xml
- Atom: http://vmgump.apache.org/gump/public/apache-commons/commons-jci-core/atom.xml

============================== Gump Tracking Only ===
Produced by Gump version 2.3.
Gump Run 13000031102010, vmgump.apache.org:vmgump:13000031102010
Gump E-mail Identifier (unique within run) #15.

--
Apache Gump
http://gump.apache.org/ [Instance: vmgump]

---------------------------------------------------------------------
To unsubscribe, e-mail: dev-unsubscribe@commons.apache.org
For additional commands, e-mail: dev-help@commons.apache.org


Mime
View raw message