commons-dev mailing list archives

Site index · List index
Message view « Date » · « Thread »
Top « Date » · « Thread »
From Gump <iss...@commons.apache.org>
Subject [GUMP@vmgump]: Project commons-scxml-test (in module apache-commons) failed
Date Tue, 14 Sep 2010 05:07:06 GMT
To whom it may engage...
        
This is an automated request, but not an unsolicited one. For 
more information please visit http://gump.apache.org/nagged.html, 
and/or contact the folk at general@gump.apache.org.

Project commons-scxml-test has an issue affecting its community integration.
This issue affects 1 projects,
 and has been outstanding for 53 runs.
The current state of this project is 'Failed', with reason 'Build Failed'.
For reference only, the following projects are affected by this:
    - commons-scxml-test :  Apache Commons


Full details are available at:
    http://vmgump.apache.org/gump/public/apache-commons/commons-scxml-test/index.html

That said, some information snippets are provided here.

The following annotations (debug/informational/warning/error messages) were provided:
 -WARNING- Overriding Maven2 settings: [/srv/gump/public/workspace/apache-commons/scxml/gump_mvn_settings.xml]
 -DEBUG- (Gump generated) Maven2 Settings in: /srv/gump/public/workspace/apache-commons/scxml/gump_mvn_settings.xml
 -INFO- Failed with reason build failed
 -DEBUG- Maven POM in: /srv/gump/public/workspace/apache-commons/scxml/pom.xml
 -INFO- Project Reports in: /srv/gump/public/workspace/apache-commons/scxml/target/surefire-reports



The following work was performed:
http://vmgump.apache.org/gump/public/apache-commons/commons-scxml-test/gump_work/build_apache-commons_commons-scxml-test.html
Work Name: build_apache-commons_commons-scxml-test (Type: Build)
Work ended in a state of : Failed
Elapsed: 19 secs
Command Line: mvn --batch-mode --settings /srv/gump/public/workspace/apache-commons/scxml/gump_mvn_settings.xml
test 
[Working Directory: /srv/gump/public/workspace/apache-commons/scxml]
---------------------------------------------
Tests run: 5, Failures: 0, Errors: 3, Skipped: 0, Time elapsed: 0.23 sec <<< FAILURE!
Running org.apache.commons.scxml.model.ModelTestSuite
Tests run: 78, Failures: 2, Errors: 4, Skipped: 0, Time elapsed: 3.115 sec <<< FAILURE!
Running org.apache.commons.scxml.env.faces.EnvFacesTestSuite
Tests run: 1, Failures: 0, Errors: 0, Skipped: 0, Time elapsed: 0.019 sec
Running org.apache.commons.scxml.semantics.SemanticsTestSuite
Tests run: 6, Failures: 0, Errors: 0, Skipped: 0, Time elapsed: 0.011 sec
Running org.apache.commons.scxml.env.jsp.EnvJspTestSuite
Tests run: 3, Failures: 0, Errors: 0, Skipped: 0, Time elapsed: 0.097 sec
Running org.apache.commons.scxml.env.jexl.EnvJexlTestSuite
Tests run: 6, Failures: 0, Errors: 0, Skipped: 0, Time elapsed: 0.059 sec
Running org.apache.commons.scxml.env.servlet.EnvServletTestSuite
Tests run: 1, Failures: 0, Errors: 0, Skipped: 0, Time elapsed: 0.01 sec
Running org.apache.commons.scxml.io.IOTestSuite
Tests run: 30, Failures: 0, Errors: 3, Skipped: 0, Time elapsed: 0.531 sec <<< FAILURE!

Results :

Failed tests: 
  testNamespacePrefixedXPathsEL(org.apache.commons.scxml.NamespacePrefixedXPathsTest)
  testCustomActionCallbacks(org.apache.commons.scxml.model.CustomActionTest)
  testDatamodelSimultaneousJsp(org.apache.commons.scxml.model.DatamodelTest)

Tests in error: 
  test01issue62(org.apache.commons.scxml.issues.Issue62Test)
  test02issue62(org.apache.commons.scxml.issues.Issue62Test)
  test03issue62(org.apache.commons.scxml.issues.Issue62Test)
  testStateActions(org.apache.commons.scxml.model.ActionsTest)
  testParallelActions(org.apache.commons.scxml.model.ActionsTest)
  testInitialActions(org.apache.commons.scxml.model.ActionsTest)
  testCustomActionExternalSrcHelloWorld(org.apache.commons.scxml.model.CustomActionTest)
  testRecursiveSrcInclude(org.apache.commons.scxml.io.StateSrcTest)
  testBadSrcInclude(org.apache.commons.scxml.io.StateSrcTest)
  testBadSrcFragmentInclude(org.apache.commons.scxml.io.StateSrcTest)

Tests run: 228, Failures: 3, Errors: 10, Skipped: 0

[INFO] ------------------------------------------------------------------------
[ERROR] BUILD FAILURE
[INFO] ------------------------------------------------------------------------
[INFO] There are test failures.

Please refer to /srv/gump/public/workspace/apache-commons/scxml/target/surefire-reports for
the individual test results.
[INFO] ------------------------------------------------------------------------
[INFO] For more information, run Maven with the -e switch
[INFO] ------------------------------------------------------------------------
[INFO] Total time: 18 seconds
[INFO] Finished at: Tue Sep 14 05:07:04 UTC 2010
[INFO] Final Memory: 40M/97M
[INFO] ------------------------------------------------------------------------
---------------------------------------------

To subscribe to this information via syndicated feeds:
- RSS: http://vmgump.apache.org/gump/public/apache-commons/commons-scxml-test/rss.xml
- Atom: http://vmgump.apache.org/gump/public/apache-commons/commons-scxml-test/atom.xml

============================== Gump Tracking Only ===
Produced by Gump version 2.3.
Gump Run 11000014092010, vmgump.apache.org:vmgump:11000014092010
Gump E-mail Identifier (unique within run) #19.

--
Apache Gump
http://gump.apache.org/ [Instance: vmgump]

---------------------------------------------------------------------
To unsubscribe, e-mail: dev-unsubscribe@commons.apache.org
For additional commands, e-mail: dev-help@commons.apache.org


Mime
View raw message