commons-dev mailing list archives

Site index · List index
Message view « Date » · « Thread »
Top « Date » · « Thread »
From Gump <iss...@commons.apache.org>
Subject [GUMP@vmgump]: Project commons-digester-test (in module apache-commons) failed
Date Sun, 12 Sep 2010 14:14:43 GMT
To whom it may engage...
        
This is an automated request, but not an unsolicited one. For 
more information please visit http://gump.apache.org/nagged.html, 
and/or contact the folk at general@gump.apache.org.

Project commons-digester-test has an issue affecting its community integration.
This issue affects 1 projects.
The current state of this project is 'Failed', with reason 'Build Failed'.
For reference only, the following projects are affected by this:
    - commons-digester-test :  Apache Commons


Full details are available at:
    http://vmgump.apache.org/gump/public/apache-commons/commons-digester-test/index.html

That said, some information snippets are provided here.

The following annotations (debug/informational/warning/error messages) were provided:
 -WARNING- Overriding Maven2 settings: [/srv/gump/public/workspace/apache-commons/digester/gump_mvn_settings.xml]
 -DEBUG- (Gump generated) Maven2 Settings in: /srv/gump/public/workspace/apache-commons/digester/gump_mvn_settings.xml
 -INFO- Failed with reason build failed
 -DEBUG- Maven POM in: /srv/gump/public/workspace/apache-commons/digester/pom.xml
 -INFO- Project Reports in: /srv/gump/public/workspace/apache-commons/digester/target/surefire-reports



The following work was performed:
http://vmgump.apache.org/gump/public/apache-commons/commons-digester-test/gump_work/build_apache-commons_commons-digester-test.html
Work Name: build_apache-commons_commons-digester-test (Type: Build)
Work ended in a state of : Failed
Elapsed: 15 secs
Command Line: mvn --batch-mode --settings /srv/gump/public/workspace/apache-commons/digester/gump_mvn_settings.xml
test 
[Working Directory: /srv/gump/public/workspace/apache-commons/digester]
---------------------------------------------
Running org.apache.commons.digester.xmlrules.FromXmlRuleSetTest
Tests run: 1, Failures: 0, Errors: 0, Skipped: 0, Time elapsed: 0.013 sec
Running org.apache.commons.digester.RulesBaseTestCase
Tests run: 5, Failures: 0, Errors: 0, Skipped: 0, Time elapsed: 0.012 sec
Running org.apache.commons.digester.NodeCreateRuleTestCase
Tests run: 10, Failures: 0, Errors: 0, Skipped: 0, Time elapsed: 0.094 sec
Running org.apache.commons.digester.DigesterTestCase
Tests run: 19, Failures: 0, Errors: 0, Skipped: 0, Time elapsed: 0.073 sec
Running org.apache.commons.digester.plugins.TestConfigurablePluginAttributes
Tests run: 3, Failures: 0, Errors: 3, Skipped: 0, Time elapsed: 0.065 sec <<< FAILURE!
Running org.apache.commons.digester.RegexRulesTestCase
Tests run: 5, Failures: 0, Errors: 0, Skipped: 0, Time elapsed: 0.025 sec

Results :

Tests in error: 
  testLocalRules(org.apache.commons.digester.plugins.TestLocalRules)
  testNonStandardLocalRules(org.apache.commons.digester.plugins.TestLocalRules)
  testSetUnknownProperty(org.apache.commons.digester.BeanPropertySetterRuleTestCase)
  testRecursiveRules(org.apache.commons.digester.plugins.TestRecursion)
  testDefaultPlugins1(org.apache.commons.digester.plugins.TestDefaultPlugin)
  testNegative(org.apache.commons.digester.SetPropertyRuleTestCase)
  testInlineDeclaration(org.apache.commons.digester.plugins.TestInline)
  testLeadingSlash(org.apache.commons.digester.plugins.TestInline)
  testIgnoreMissing(org.apache.commons.digester.SetPropertiesRuleTestCase)
  testNegativeNotIgnoreMissing(org.apache.commons.digester.SetPropertiesRuleTestCase)
  testPredeclaration(org.apache.commons.digester.plugins.TestDeclaration)
  testMandatoryProperties(org.apache.commons.digester.SetNestedPropertiesRuleTestCase)
  testUnknownChildrenCausesException(org.apache.commons.digester.SetNestedPropertiesRuleTestCase)
  testUnknownChildrenExceptionOverride(org.apache.commons.digester.SetNestedPropertiesRuleTestCase)
  testRecursiveNestedProperties(org.apache.commons.digester.SetNestedPropertiesRuleTestCase)
  testDefaultBehaviour(org.apache.commons.digester.plugins.TestConfigurablePluginAttributes)
  testGlobalOverride(org.apache.commons.digester.plugins.TestConfigurablePluginAttributes)
  testInstanceOverride(org.apache.commons.digester.plugins.TestConfigurablePluginAttributes)

Tests run: 174, Failures: 0, Errors: 18, Skipped: 0

[INFO] ------------------------------------------------------------------------
[ERROR] BUILD FAILURE
[INFO] ------------------------------------------------------------------------
[INFO] There are test failures.

Please refer to /srv/gump/public/workspace/apache-commons/digester/target/surefire-reports
for the individual test results.
[INFO] ------------------------------------------------------------------------
[INFO] For more information, run Maven with the -e switch
[INFO] ------------------------------------------------------------------------
[INFO] Total time: 14 seconds
[INFO] Finished at: Sun Sep 12 14:14:40 UTC 2010
[INFO] Final Memory: 42M/102M
[INFO] ------------------------------------------------------------------------
---------------------------------------------

To subscribe to this information via syndicated feeds:
- RSS: http://vmgump.apache.org/gump/public/apache-commons/commons-digester-test/rss.xml
- Atom: http://vmgump.apache.org/gump/public/apache-commons/commons-digester-test/atom.xml

============================== Gump Tracking Only ===
Produced by Gump version 2.3.
Gump Run 21001212092010, vmgump.apache.org:vmgump:21001212092010
Gump E-mail Identifier (unique within run) #2.

--
Apache Gump
http://gump.apache.org/ [Instance: vmgump]

---------------------------------------------------------------------
To unsubscribe, e-mail: dev-unsubscribe@commons.apache.org
For additional commands, e-mail: dev-help@commons.apache.org


Mime
View raw message