commons-dev mailing list archives

Site index · List index
Message view « Date » · « Thread »
Top « Date » · « Thread »
From Gump <iss...@commons.apache.org>
Subject [GUMP@vmgump]: Project commons-jelly-tags-xml-test (in module commons-jelly) failed
Date Mon, 23 Aug 2010 11:52:17 GMT
To whom it may engage...
        
This is an automated request, but not an unsolicited one. For 
more information please visit http://gump.apache.org/nagged.html, 
and/or contact the folk at general@gump.apache.org.

Project commons-jelly-tags-xml-test has an issue affecting its community integration.
This issue affects 1 projects,
 and has been outstanding for 11 runs.
The current state of this project is 'Failed', with reason 'Build Failed'.
For reference only, the following projects are affected by this:
    - commons-jelly-tags-xml-test :  Commons Jelly


Full details are available at:
    http://vmgump.apache.org/gump/public/commons-jelly/commons-jelly-tags-xml-test/index.html

That said, some information snippets are provided here.

The following annotations (debug/informational/warning/error messages) were provided:
 -DEBUG- Dependency on xml-xerces exists, no need to add for property maven.jar.xerces.
 -DEBUG- Dependency on commons-jexl-1.x exists, no need to add for property maven.jar.commons-jexl.
 -DEBUG- Dependency on xalan exists, no need to add for property maven.jar.xalan.
 -WARNING- Overriding Maven properties: [/srv/gump/public/workspace/commons-jelly/jelly-tags/xml/build.properties]
 -DEBUG- (Gump generated) Maven Properties in: /srv/gump/public/workspace/commons-jelly/jelly-tags/xml/build.properties
 -INFO- Failed with reason build failed
 -DEBUG- Maven POM in: /srv/gump/public/workspace/commons-jelly/jelly-tags/xml/project.xml
 -DEBUG- Maven project properties in: /srv/gump/public/workspace/commons-jelly/jelly-tags/xml/project.properties
 -INFO- Project Reports in: /srv/gump/public/workspace/commons-jelly/jelly-tags/xml/target/test-reports



The following work was performed:
http://vmgump.apache.org/gump/public/commons-jelly/commons-jelly-tags-xml-test/gump_work/build_commons-jelly_commons-jelly-tags-xml-test.html
Work Name: build_commons-jelly_commons-jelly-tags-xml-test (Type: Build)
Work ended in a state of : Failed
Elapsed: 13 secs
Command Line: maven --offline jar 
[Working Directory: /srv/gump/public/workspace/commons-jelly/jelly-tags/xml]
---------------------------------------------
    [junit] Should produce the correct output expected:<...:test="http://apache/testNS"
xmlns="http://java/ns" test:abc="testValue"><test-subnode xmlns="" attr="test"><test-anotherSubNode></test-anotherSubNode><test-anotherSubNodeAgain
xmlns:other="http://java/ns" xmlns...> but was:<...="http://java/ns" xmlns:test="http://apache/testNS"
test:abc="testValue"><test-subnode xmlns="" attr="test"><test-anotherSubNode></test-anotherSubNode><test-anotherSubNodeAgain
xmlns="http://java/ns" xmlns:other...>
    [junit] junit.framework.ComparisonFailure: Should produce the correct output expected:<...:test="http://apache/testNS"
xmlns="http://java/ns" test:abc="testValue"><test-subnode xmlns="" attr="test"><test-anotherSubNode></test-anotherSubNode><test-anotherSubNodeAgain
xmlns:other="http://java/ns" xmlns...> but was:<...="http://java/ns" xmlns:test="http://apache/testNS"
test:abc="testValue"><test-subnode xmlns="" attr="test"><test-anotherSubNode></test-anotherSubNode><test-anotherSubNodeAgain
xmlns="http://java/ns" xmlns:other...>
    [junit] 	at org.apache.commons.jelly.tags.xml.TestXMLTags.testNamespaceReplace(TestXMLTags.java:148)
    [junit] 	at sun.reflect.NativeMethodAccessorImpl.invoke0(Native Method)
    [junit] 	at sun.reflect.NativeMethodAccessorImpl.invoke(NativeMethodAccessorImpl.java:57)
    [junit] 	at sun.reflect.DelegatingMethodAccessorImpl.invoke(DelegatingMethodAccessorImpl.java:43)
    [junit] 
    [junit] 
    [junit] Testcase: testAttributeNameSpace(org.apache.commons.jelly.tags.xml.TestXMLTags):
FAILED
    [junit] Should produce the correct output expected:<...:test="http://apache/testNS"
xmlns="http://apache/true...> but was:<...="http://apache/trueNS" xmlns:test="http://apache/test...>
    [junit] junit.framework.ComparisonFailure: Should produce the correct output expected:<...:test="http://apache/testNS"
xmlns="http://apache/true...> but was:<...="http://apache/trueNS" xmlns:test="http://apache/test...>
    [junit] 	at org.apache.commons.jelly.tags.xml.TestXMLTags.testAttributeNameSpace(TestXMLTags.java:166)
    [junit] 	at sun.reflect.NativeMethodAccessorImpl.invoke0(Native Method)
    [junit] 	at sun.reflect.NativeMethodAccessorImpl.invoke(NativeMethodAccessorImpl.java:57)
    [junit] 	at sun.reflect.DelegatingMethodAccessorImpl.invoke(DelegatingMethodAccessorImpl.java:43)
    [junit] 
    [junit] 
    [junit] Testcase: testAttributeNameSpaceDefaultNS(org.apache.commons.jelly.tags.xml.TestXMLTags):
FAILED
    [junit] Should produce the correct output expected:<...:test="http://apache/testNS"
xmlns="http://apache/true...> but was:<...="http://apache/trueNS" xmlns:test="http://apache/test...>
    [junit] junit.framework.ComparisonFailure: Should produce the correct output expected:<...:test="http://apache/testNS"
xmlns="http://apache/true...> but was:<...="http://apache/trueNS" xmlns:test="http://apache/test...>
    [junit] 	at org.apache.commons.jelly.tags.xml.TestXMLTags.testAttributeNameSpaceDefaultNS(TestXMLTags.java:179)
    [junit] 	at sun.reflect.NativeMethodAccessorImpl.invoke0(Native Method)
    [junit] 	at sun.reflect.NativeMethodAccessorImpl.invoke(NativeMethodAccessorImpl.java:57)
    [junit] 	at sun.reflect.DelegatingMethodAccessorImpl.invoke(DelegatingMethodAccessorImpl.java:43)
    [junit] 
    [junit] 
    [junit] [ERROR] TEST org.apache.commons.jelly.tags.xml.TestXMLTags FAILED
    [junit] Running org.apache.commons.jelly.tags.xml.TestJelly
    [junit] <foo>some text
    [junit]         
    [junit]         The exception was: file:/srv/gump/public/workspace/commons-jelly/jelly-tags/xml/target/test-classes/org/apache/commons/jelly/tags/xml/suite.jelly:105:45:
<test:assert> file:/srv/gump/public/workspace/commons-jelly/jelly-tags/xml/target/test-classes/org/apache/commons/jelly/tags/xml/suite.jelly:105:45:
<test:assert> This should always fail. Assertion failed while evaluating xpath: $doc/foo/xyz
    [junit]   
    [junit]     exists = true, readable = true, class=java.io.File
    [junit]     
    [junit]   
    [junit] 				blurp=, blurpAndX=X
    [junit]         Tests run: 15, Failures: 0, Errors: 0, Time elapsed: 0.419 sec
    [junit] Testsuite: org.apache.commons.jelly.tags.xml.TestJelly
    [junit] Tests run: 15, Failures: 0, Errors: 0, Time elapsed: 0.419 sec
    [junit] 

BUILD FAILED
File...... /home/gump/.maven/cache/maven-test-plugin-1.6.2/plugin.jelly
Element... fail
Line...... 181
Column.... 54
There were test failures.
Total time: 13 seconds
Finished at: Mon Aug 23 11:52:17 UTC 2010

---------------------------------------------

To subscribe to this information via syndicated feeds:
- RSS: http://vmgump.apache.org/gump/public/commons-jelly/commons-jelly-tags-xml-test/rss.xml
- Atom: http://vmgump.apache.org/gump/public/commons-jelly/commons-jelly-tags-xml-test/atom.xml

============================== Gump Tracking Only ===
Produced by Gump version 2.3.
Gump Run 21000623082010, vmgump.apache.org:vmgump:21000623082010
Gump E-mail Identifier (unique within run) #36.

--
Apache Gump
http://gump.apache.org/ [Instance: vmgump]

---------------------------------------------------------------------
To unsubscribe, e-mail: dev-unsubscribe@commons.apache.org
For additional commands, e-mail: dev-help@commons.apache.org


Mime
View raw message