commons-dev mailing list archives

Site index · List index
Message view « Date » · « Thread »
Top « Date » · « Thread »
From Gump <iss...@commons.apache.org>
Subject [GUMP@vmgump]: Project commons-javaflow (in module commons-sandbox) failed
Date Fri, 13 Aug 2010 11:51:53 GMT
To whom it may engage...
        
This is an automated request, but not an unsolicited one. For 
more information please visit http://gump.apache.org/nagged.html, 
and/or contact the folk at general@gump.apache.org.

Project commons-javaflow has an issue affecting its community integration.
This issue affects 1 projects,
 and has been outstanding for 9 runs.
The current state of this project is 'Failed', with reason 'Build Failed'.
For reference only, the following projects are affected by this:
    - commons-javaflow :  Commons Javaflow


Full details are available at:
    http://vmgump.apache.org/gump/public/commons-sandbox/commons-javaflow/index.html

That said, some information snippets are provided here.

The following annotations (debug/informational/warning/error messages) were provided:
 -DEBUG- Sole jar output [commons-javaflow-*[0-9T].jar] identifier set to project name
 -DEBUG- (Gump generated) Maven2 Settings in: /srv/gump/public/workspace/commons-sandbox/javaflow/gump_mvn_settings.xml
 -INFO- Failed with reason build failed
 -DEBUG- Maven POM in: /srv/gump/public/workspace/commons-sandbox/javaflow/pom.xml
 -INFO- Project Reports in: /srv/gump/public/workspace/commons-sandbox/javaflow/target/surefire-reports
 -WARNING- No directory [/srv/gump/public/workspace/commons-sandbox/javaflow/target/surefire-reports]
 -INFO- Failed to extract fallback artifacts from Gump Repository



The following work was performed:
http://vmgump.apache.org/gump/public/commons-sandbox/commons-javaflow/gump_work/build_commons-sandbox_commons-javaflow.html
Work Name: build_commons-sandbox_commons-javaflow (Type: Build)
Work ended in a state of : Failed
Elapsed: 17 secs
Command Line: mvn --batch-mode --settings /srv/gump/public/workspace/commons-sandbox/javaflow/gump_mvn_settings.xml
package 
[Working Directory: /srv/gump/public/workspace/commons-sandbox/javaflow]
---------------------------------------------
Downloading: http://localhost:8192/maven2/asm/asm-analysis/3.2/asm-analysis-3.2.jar
17K downloaded  (asm-analysis-3.2.jar)
Downloading: http://localhost:8192/maven2/asm/asm-util/3.2/asm-util-3.2.jar
34K downloaded  (asm-util-3.2.jar)
[INFO] [antrun:run {execution: javadoc.resources}]
[INFO] Executing tasks
     [copy] Copying 2 files to /srv/gump/public/workspace/commons-sandbox/javaflow/target/apidocs/META-INF
[INFO] Executed tasks
[INFO] Setting property: classpath.resource.loader.class => 'org.codehaus.plexus.velocity.ContextClassLoaderResourceLoader'.
[INFO] Setting property: velocimacro.messages.on => 'false'.
[INFO] Setting property: resource.loader => 'classpath'.
[INFO] Setting property: resource.manager.logwhenfound => 'false'.
[INFO] [remote-resources:process {execution: default}]
[INFO] [resources:resources {execution: default-resources}]
[INFO] Using 'iso-8859-1' encoding to copy filtered resources.
[INFO] Copying 2 resources to META-INF
[INFO] [compiler:compile {execution: default-compile}]
[INFO] Compiling 35 source files to /srv/gump/public/workspace/commons-sandbox/javaflow/target/classes
[INFO] [bundle:manifest {execution: bundle-manifest}]
[INFO] [resources:testResources {execution: default-testResources}]
[INFO] Using 'iso-8859-1' encoding to copy filtered resources.
[INFO] skip non existing resourceDirectory /srv/gump/public/workspace/commons-sandbox/javaflow/src/test/resources
[INFO] [compiler:testCompile {execution: default-testCompile}]
[INFO] Compiling 23 source files to /srv/gump/public/workspace/commons-sandbox/javaflow/target/test-classes
[INFO] -------------------------------------------------------------
[ERROR] COMPILATION ERROR : 
[INFO] -------------------------------------------------------------
[ERROR] /srv/gump/public/workspace/commons-sandbox/javaflow/src/test/java/org/apache/commons/javaflow/AsmTestSuite.java:[73,13]
addTestSuite(java.lang.Class<? extends junit.framework.TestCase>) in junit.framework.TestSuite
cannot be applied to (java.lang.Class<capture#647 of ?>)

[ERROR] /srv/gump/public/workspace/commons-sandbox/javaflow/src/test/java/org/apache/commons/javaflow/AsmTestSuite.java:[74,13]
addTestSuite(java.lang.Class<? extends junit.framework.TestCase>) in junit.framework.TestSuite
cannot be applied to (java.lang.Class<capture#397 of ?>)

[INFO] 2 errors 
[INFO] -------------------------------------------------------------
[INFO] ------------------------------------------------------------------------
[ERROR] BUILD FAILURE
[INFO] ------------------------------------------------------------------------
[INFO] Compilation failure

/srv/gump/public/workspace/commons-sandbox/javaflow/src/test/java/org/apache/commons/javaflow/AsmTestSuite.java:[73,13]
addTestSuite(java.lang.Class<? extends junit.framework.TestCase>) in junit.framework.TestSuite
cannot be applied to (java.lang.Class<capture#647 of ?>)

/srv/gump/public/workspace/commons-sandbox/javaflow/src/test/java/org/apache/commons/javaflow/AsmTestSuite.java:[74,13]
addTestSuite(java.lang.Class<? extends junit.framework.TestCase>) in junit.framework.TestSuite
cannot be applied to (java.lang.Class<capture#397 of ?>)


[INFO] ------------------------------------------------------------------------
[INFO] For more information, run Maven with the -e switch
[INFO] ------------------------------------------------------------------------
[INFO] Total time: 16 seconds
[INFO] Finished at: Fri Aug 13 11:51:52 UTC 2010
[INFO] Final Memory: 42M/101M
[INFO] ------------------------------------------------------------------------
---------------------------------------------

To subscribe to this information via syndicated feeds:
- RSS: http://vmgump.apache.org/gump/public/commons-sandbox/commons-javaflow/rss.xml
- Atom: http://vmgump.apache.org/gump/public/commons-sandbox/commons-javaflow/atom.xml

============================== Gump Tracking Only ===
Produced by Gump version 2.3.
Gump Run 21000613082010, vmgump.apache.org:vmgump:21000613082010
Gump E-mail Identifier (unique within run) #33.

--
Apache Gump
http://gump.apache.org/ [Instance: vmgump]

---------------------------------------------------------------------
To unsubscribe, e-mail: dev-unsubscribe@commons.apache.org
For additional commands, e-mail: dev-help@commons.apache.org


Mime
View raw message