commons-dev mailing list archives

Site index · List index
Message view « Date » · « Thread »
Top « Date » · « Thread »
From Gump <iss...@commons.apache.org>
Subject [GUMP@vmgump]: Project commons-collections4 (in module apache-commons) failed
Date Tue, 11 May 2010 01:31:59 GMT
To whom it may engage...
        
This is an automated request, but not an unsolicited one. For 
more information please visit http://gump.apache.org/nagged.html, 
and/or contact the folk at general@gump.apache.org.

Project commons-collections4 has an issue affecting its community integration.
This issue affects 2 projects,
 and has been outstanding for 44 runs.
The current state of this project is 'Failed', with reason 'Build Failed'.
For reference only, the following projects are affected by this:
    - commons-collections4 :  Collections
    - commons-collections4-testframework :  Apache Commons


Full details are available at:
    http://vmgump.apache.org/gump/public/apache-commons/commons-collections4/index.html

That said, some information snippets are provided here.

The following annotations (debug/informational/warning/error messages) were provided:
 -DEBUG- (Gump generated) Maven2 Settings in: /srv/gump/public/workspace/apache-commons/collections/gump_mvn_settings.xml
 -INFO- Failed with reason build failed
 -DEBUG- Maven POM in: /srv/gump/public/workspace/apache-commons/collections/pom.xml
 -INFO- Failed to extract fallback artifacts from Gump Repository



The following work was performed:
http://vmgump.apache.org/gump/public/apache-commons/commons-collections4/gump_work/build_apache-commons_commons-collections4.html
Work Name: build_apache-commons_commons-collections4 (Type: Build)
Work ended in a state of : Failed
Elapsed: 56 secs
Command Line: mvn --batch-mode --settings /srv/gump/public/workspace/apache-commons/collections/gump_mvn_settings.xml
package 
[Working Directory: /srv/gump/public/workspace/apache-commons/collections]
CLASSPATH: /usr/lib/jvm/java-6-sun/lib/tools.jar:/srv/gump/public/workspace/commons-lang-2.x/target/commons-lang-2.6-SNAPSHOT.jar:/srv/gump/public/workspace/junit/dist/junit-11052010.jar:/srv/gump/public/workspace/ant/dist/lib/ant-jmf.jar:/srv/gump/public/workspace/ant/dist/lib/ant-swing.jar:/srv/gump/public/workspace/ant/dist/lib/ant-apache-resolver.jar:/srv/gump/public/workspace/ant/dist/lib/ant-apache-xalan2.jar:/srv/gump/public/workspace/ant/dist/lib/ant-junit.jar:/srv/gump/public/workspace/ant/dist/lib/ant-launcher.jar:/srv/gump/public/workspace/ant/dist/lib/ant-nodeps.jar:/srv/gump/public/workspace/ant/dist/lib/ant.jar
---------------------------------------------

[INFO] [antrun:run {execution: javadoc.resources}]
[INFO] Executing tasks
     [copy] Copying 2 files to /srv/gump/public/workspace/apache-commons/collections/target/apidocs/META-INF
[INFO] Executed tasks
[INFO] Setting property: classpath.resource.loader.class => 'org.codehaus.plexus.velocity.ContextClassLoaderResourceLoader'.
[INFO] Setting property: velocimacro.messages.on => 'false'.
[INFO] Setting property: resource.loader => 'classpath'.
[INFO] Setting property: resource.manager.logwhenfound => 'false'.
[INFO] [remote-resources:process {execution: default}]
[INFO] [resources:resources {execution: default-resources}]
[INFO] Using 'UTF-8' encoding to copy filtered resources.
[INFO] Copying 2 resources to META-INF
[INFO] [compiler:compile {execution: default-compile}]
[INFO] Compiling 254 source files to /srv/gump/public/workspace/apache-commons/collections/target/classes
[INFO] [bundle:manifest {execution: bundle-manifest}]
[INFO] [resources:testResources {execution: default-testResources}]
[INFO] Using 'UTF-8' encoding to copy filtered resources.
[INFO] skip non existing resourceDirectory /srv/gump/public/workspace/apache-commons/collections/src/test/resources
[INFO] [compiler:testCompile {execution: default-testCompile}]
[INFO] Compiling 187 source files to /srv/gump/public/workspace/apache-commons/collections/target/test-classes
[INFO] [surefire:test {execution: default-test}]
[INFO] Surefire report directory: /srv/gump/public/workspace/apache-commons/collections/target/surefire-reports

-------------------------------------------------------
 T E S T S
-------------------------------------------------------
Running org.apache.commons.collections.TestAllPackages
Tests run: 11021, Failures: 0, Errors: 1, Skipped: 0, Time elapsed: 26.994 sec <<<
FAILURE!

Results :

Tests in error: 
  testAddToFullBufferRemoveViaIterator(org.apache.commons.collections.buffer.TestBoundedBuffer)

Tests run: 11021, Failures: 0, Errors: 1, Skipped: 0

[INFO] ------------------------------------------------------------------------
[ERROR] BUILD FAILURE
[INFO] ------------------------------------------------------------------------
[INFO] There are test failures.

Please refer to /srv/gump/public/workspace/apache-commons/collections/target/surefire-reports
for the individual test results.
[INFO] ------------------------------------------------------------------------
[INFO] For more information, run Maven with the -e switch
[INFO] ------------------------------------------------------------------------
[INFO] Total time: 54 seconds
[INFO] Finished at: Tue May 11 01:31:58 PDT 2010
[INFO] Final Memory: 28M/65M
[INFO] ------------------------------------------------------------------------
---------------------------------------------

To subscribe to this information via syndicated feeds:
- RSS: http://vmgump.apache.org/gump/public/apache-commons/commons-collections4/rss.xml
- Atom: http://vmgump.apache.org/gump/public/apache-commons/commons-collections4/atom.xml

============================== Gump Tracking Only ===
Produced by Gump version 2.3.
Gump Run 08000011052010, vmgump:vmgump-public:08000011052010
Gump E-mail Identifier (unique within run) #7.

--
Apache Gump
http://gump.apache.org/ [Instance: vmgump]

---------------------------------------------------------------------
To unsubscribe, e-mail: dev-unsubscribe@commons.apache.org
For additional commands, e-mail: dev-help@commons.apache.org


Mime
View raw message