commons-dev mailing list archives

Site index · List index
Message view « Date » · « Thread »
Top « Date » · « Thread »
From "Continuum@vmbuild.apache.org" <contin...@apache.org>
Subject [continuum] BUILD FAILURE: Commons - Commons DBCP -
Date Sun, 20 Dec 2009 18:44:11 GMT
Online report : http://vmbuild.apache.org/continuum/buildResult.action?buildId=260382&projectId=22

Build statistics:
  State: Failed
  Previous State: Ok
  Started at: Sun 20 Dec 2009 10:41:44 -0800
  Finished at: Sun 20 Dec 2009 10:43:52 -0800
  Total time: 2m 7s
  Build Trigger: Schedule
  Build Number: 121
  Exit code: 1
  Building machine hostname: vmbuild.apache.org
  Operating system : Linux(unknown)
  Java Home version : 
          java version "1.6.0_06"
          Java(TM) SE Runtime Environment (build 1.6.0_06-b02)
          Java HotSpot(TM) Client VM (build 10.0-b22, mixed mode, sharing)
        
  Builder version :
          Maven version: 2.0.9
          Java version: 1.6.0_06
          OS name: "linux" version: "2.6.24-23-server" arch: "i386" Family: "unix"
    
****************************************************************************
SCM Changes:
****************************************************************************
Changed: no author @ no date
Comment: no comment
Files changed:
  src/test/org/apache/commons/dbcp/TestJOCLed.java ( no revision )
  build-1.3.xml ( no revision )
  build.xml ( no revision )
  build.properties.sample ( no revision )

****************************************************************************
Dependencies Changes:
****************************************************************************
No dependencies changed


****************************************************************************
Build Definition:
****************************************************************************
POM filename: pom.xml
Goals: clean deploy   
Arguments: --batch-mode -DaltDeploymentRepository=vmbuild.repo::default::file://localhost/home/continuum/data/commons -Pci
Build Fresh: false
Always Build: false
Default Build Definition: true
Schedule: COMMONS_SCHEDULE
Profile Name: JDK 6
Description: 

****************************************************************************
Test Summary:
****************************************************************************
Tests: 443
Failures: 1
Errors: 21
Success Rate: 95
Total time: 49.850994

****************************************************************************
Test Failures:
****************************************************************************

TestJOCLed
    testPooling :
  java.sql.SQLException
  java.sql.SQLException: Could not parse configuration file
	at org.apache.commons.dbcp.PoolingDriver.getConnectionPool(PoolingDriver.java:119)
	at org.apache.commons.dbcp.PoolingDriver.connect(PoolingDriver.java:175)
	at java.sql.DriverManager.getConnection(DriverManager.java:582)
	at java.sql.DriverManager.getConnection(DriverManager.java:207)
	at org.apache.commons.dbcp.TestJOCLed.getConnection(TestJOCLed.java:43)
	at org.apache.commons.dbcp.TestConnectionPool.newConnection(TestConnectionPool.java:84)
	at org.apache.commons.dbcp.TestConnectionPool.testPooling(TestConnectionPool.java:402)
	at sun.reflect.NativeMethodAccessorImpl.invoke0(Native Method)
	at sun.reflect.NativeMethodAccessorImpl.invoke(NativeMethodAccessorImpl.java:39)
	at sun.reflect.DelegatingMethodAccessorImpl.invoke(DelegatingMethodAccessorImpl.java:25)
	at java.lang.reflect.Method.invoke(Method.java:597)
	at junit.framework.TestCase.runTest(TestCase.java:164)
	at junit.framework.TestCase.runBare(TestCase.java:130)
	at junit.framework.TestResult$1.protect(TestResult.java:106)
	at junit.framework.TestResult.runProtected(TestResult.java:124)
	at junit.framework.TestResult.run(TestResult.java:109)
	at junit.framework.TestCase.run(TestCase.java:120)
	at junit.framework.TestSuite.runTest(TestSuite.java:230)
	at junit.framework.TestSuite.run(TestSuite.java:225)
	at sun.reflect.GeneratedMethodAccessor2.invoke(Unknown Source)
	at sun.reflect.DelegatingMethodAccessorImpl.invoke(DelegatingMethodAccessorImpl.java:25)
	at java.lang.reflect.Method.invoke(Method.java:597)
	at org.apache.maven.surefire.junit.JUnitTestSet.execute(JUnitTestSet.java:213)
	at org.apache.maven.surefire.suite.AbstractDirectoryTestSuite.executeTestSet(AbstractDirectoryTestSuite.java:140)
	at org.apache.maven.surefire.suite.AbstractDirectoryTestSuite.execute(AbstractDirectoryTestSuite.java:127)
	at org.apache.maven.surefire.Surefire.run(Surefire.java:177)
	at sun.reflect.NativeMethodAccessorImpl.invoke0(Native Method)
	at sun.reflect.NativeMethodAccessorImpl.invoke(NativeMethodAccessorImpl.java:39)
	at sun.reflect.DelegatingMethodAccessorImpl.invoke(DelegatingMethodAccessorImpl.java:25)
	at java.lang.reflect.Method.invoke(Method.java:597)
	at org.apache.maven.surefire.booter.SurefireBooter.runSuitesInProcess(SurefireBooter.java:345)
	at org.apache.maven.surefire.booter.SurefireBooter.main(SurefireBooter.java:1009)
Caused by: java.lang.ClassNotFoundException: org.apache.xerces.parsers.SAXParser
	at org.xml.sax.helpers.XMLReaderFactory.loadClass(XMLReaderFactory.java:189)
	at org.xml.sax.helpers.XMLReaderFactory.createXMLReader(XMLReaderFactory.java:150)
	at org.apache.commons.jocl.JOCLContentHandler.parse(JOCLContentHandler.java:339)
	at org.apache.commons.jocl.JOCLContentHandler.parse(JOCLContentHandler.java:271)
	at org.apache.commons.dbcp.PoolingDriver.getConnectionPool(PoolingDriver.java:116)
	... 31 more
Caused by: java.lang.ClassNotFoundException: org.apache.xerces.parsers.SAXParser
	at org.xml.sax.helpers.XMLReaderFactory.loadClass(XMLReaderFactory.java:189)
	at org.xml.sax.helpers.XMLReaderFactory.createXMLReader(XMLReaderFactory.java:150)
	at org.apache.commons.jocl.JOCLContentHandler.parse(JOCLContentHandler.java:339)
	at org.apache.commons.jocl.JOCLContentHandler.parse(JOCLContentHandler.java:271)
	at org.apache.commons.dbcp.PoolingDriver.getConnectionPool(PoolingDriver.java:116)
	... 31 more


    testClearWarnings :
  java.sql.SQLException
  java.sql.SQLException: Could not parse configuration file
	at org.apache.commons.dbcp.PoolingDriver.getConnectionPool(PoolingDriver.java:119)
	at org.apache.commons.dbcp.PoolingDriver.connect(PoolingDriver.java:175)
	at java.sql.DriverManager.getConnection(DriverManager.java:582)
	at java.sql.DriverManager.getConnection(DriverManager.java:207)
	at org.apache.commons.dbcp.TestJOCLed.getConnection(TestJOCLed.java:43)
	at org.apache.commons.dbcp.TestConnectionPool.newConnection(TestConnectionPool.java:84)
	at org.apache.commons.dbcp.TestConnectionPool.testClearWarnings(TestConnectionPool.java:105)
	at sun.reflect.NativeMethodAccessorImpl.invoke0(Native Method)
	at sun.reflect.NativeMethodAccessorImpl.invoke(NativeMethodAccessorImpl.java:39)
	at sun.reflect.DelegatingMethodAccessorImpl.invoke(DelegatingMethodAccessorImpl.java:25)
	at java.lang.reflect.Method.invoke(Method.java:597)
	at junit.framework.TestCase.runTest(TestCase.java:164)
	at junit.framework.TestCase.runBare(TestCase.java:130)
	at junit.framework.TestResult$1.protect(TestResult.java:106)
	at junit.framework.TestResult.runProtected(TestResult.java:124)
	at junit.framework.TestResult.run(TestResult.java:109)
	at junit.framework.TestCase.run(TestCase.java:120)
	at junit.framework.TestSuite.runTest(TestSuite.java:230)
	at junit.framework.TestSuite.run(TestSuite.java:225)
	at sun.reflect.GeneratedMethodAccessor2.invoke(Unknown Source)
	at sun.reflect.DelegatingMethodAccessorImpl.invoke(DelegatingMethodAccessorImpl.java:25)
	at java.lang.reflect.Method.invoke(Method.java:597)
	at org.apache.maven.surefire.junit.JUnitTestSet.execute(JUnitTestSet.java:213)
	at org.apache.maven.surefire.suite.AbstractDirectoryTestSuite.executeTestSet(AbstractDirectoryTestSuite.java:140)
	at org.apache.maven.surefire.suite.AbstractDirectoryTestSuite.execute(AbstractDirectoryTestSuite.java:127)
	at org.apache.maven.surefire.Surefire.run(Surefire.java:177)
	at sun.reflect.NativeMethodAccessorImpl.invoke0(Native Method)
	at sun.reflect.NativeMethodAccessorImpl.invoke(NativeMethodAccessorImpl.java:39)
	at sun.reflect.DelegatingMethodAccessorImpl.invoke(DelegatingMethodAccessorImpl.java:25)
	at java.lang.reflect.Method.invoke(Method.java:597)
	at org.apache.maven.surefire.booter.SurefireBooter.runSuitesInProcess(SurefireBooter.java:345)
	at org.apache.maven.surefire.booter.SurefireBooter.main(SurefireBooter.java:1009)
Caused by: java.lang.ClassNotFoundException: org.apache.xerces.parsers.SAXParser
	at org.xml.sax.helpers.XMLReaderFactory.loadClass(XMLReaderFactory.java:189)
	at org.xml.sax.helpers.XMLReaderFactory.createXMLReader(XMLReaderFactory.java:150)
	at org.apache.commons.jocl.JOCLContentHandler.parse(JOCLContentHandler.java:339)
	at org.apache.commons.jocl.JOCLContentHandler.parse(JOCLContentHandler.java:271)
	at org.apache.commons.dbcp.PoolingDriver.getConnectionPool(PoolingDriver.java:116)
	... 31 more
Caused by: java.lang.ClassNotFoundException: org.apache.xerces.parsers.SAXParser
	at org.xml.sax.helpers.XMLReaderFactory.loadClass(XMLReaderFactory.java:189)
	at org.xml.sax.helpers.XMLReaderFactory.createXMLReader(XMLReaderFactory.java:150)
	at org.apache.commons.jocl.JOCLContentHandler.parse(JOCLContentHandler.java:339)
	at org.apache.commons.jocl.JOCLContentHandler.parse(JOCLContentHandler.java:271)
	at org.apache.commons.dbcp.PoolingDriver.getConnectionPool(PoolingDriver.java:116)
	... 31 more

    testIsClosed :
  java.sql.SQLException
  java.sql.SQLException: Could not parse configuration file
	at org.apache.commons.dbcp.PoolingDriver.getConnectionPool(PoolingDriver.java:119)
	at org.apache.commons.dbcp.PoolingDriver.connect(PoolingDriver.java:175)
	at java.sql.DriverManager.getConnection(DriverManager.java:582)
	at java.sql.DriverManager.getConnection(DriverManager.java:207)
	at org.apache.commons.dbcp.TestJOCLed.getConnection(TestJOCLed.java:43)
	at org.apache.commons.dbcp.TestConnectionPool.newConnection(TestConnectionPool.java:84)
	at org.apache.commons.dbcp.TestConnectionPool.testIsClosed(TestConnectionPool.java:136)
	at sun.reflect.NativeMethodAccessorImpl.invoke0(Native Method)
	at sun.reflect.NativeMethodAccessorImpl.invoke(NativeMethodAccessorImpl.java:39)
	at sun.reflect.DelegatingMethodAccessorImpl.invoke(DelegatingMethodAccessorImpl.java:25)
	at java.lang.reflect.Method.invoke(Method.java:597)
	at junit.framework.TestCase.runTest(TestCase.java:164)
	at junit.framework.TestCase.runBare(TestCase.java:130)
	at junit.framework.TestResult$1.protect(TestResult.java:106)
	at junit.framework.TestResult.runProtected(TestResult.java:124)
	at junit.framework.TestResult.run(TestResult.java:109)
	at junit.framework.TestCase.run(TestCase.java:120)
	at junit.framework.TestSuite.runTest(TestSuite.java:230)
	at junit.framework.TestSuite.run(TestSuite.java:225)
	at sun.reflect.GeneratedMethodAccessor2.invoke(Unknown Source)
	at sun.reflect.DelegatingMethodAccessorImpl.invoke(DelegatingMethodAccessorImpl.java:25)
	at java.lang.reflect.Method.invoke(Method.java:597)
	at org.apache.maven.surefire.junit.JUnitTestSet.execute(JUnitTestSet.java:213)
	at org.apache.maven.surefire.suite.AbstractDirectoryTestSuite.executeTestSet(AbstractDirectoryTestSuite.java:140)
	at org.apache.maven.surefire.suite.AbstractDirectoryTestSuite.execute(AbstractDirectoryTestSuite.java:127)
	at org.apache.maven.surefire.Surefire.run(Surefire.java:177)
	at sun.reflect.NativeMethodAccessorImpl.invoke0(Native Method)
	at sun.reflect.NativeMethodAccessorImpl.invoke(NativeMethodAccessorImpl.java:39)
	at sun.reflect.DelegatingMethodAccessorImpl.invoke(DelegatingMethodAccessorImpl.java:25)
	at java.lang.reflect.Method.invoke(Method.java:597)
	at org.apache.maven.surefire.booter.SurefireBooter.runSuitesInProcess(SurefireBooter.java:345)
	at org.apache.maven.surefire.booter.SurefireBooter.main(SurefireBooter.java:1009)
Caused by: java.lang.ClassNotFoundException: org.apache.xerces.parsers.SAXParser
	at org.xml.sax.helpers.XMLReaderFactory.loadClass(XMLReaderFactory.java:189)
	at org.xml.sax.helpers.XMLReaderFactory.createXMLReader(XMLReaderFactory.java:150)
	at org.apache.commons.jocl.JOCLContentHandler.parse(JOCLContentHandler.java:339)
	at org.apache.commons.jocl.JOCLContentHandler.parse(JOCLContentHandler.java:271)
	at org.apache.commons.dbcp.PoolingDriver.getConnectionPool(PoolingDriver.java:116)
	... 31 more
Caused by: java.lang.ClassNotFoundException: org.apache.xerces.parsers.SAXParser
	at org.xml.sax.helpers.XMLReaderFactory.loadClass(XMLReaderFactory.java:189)
	at org.xml.sax.helpers.XMLReaderFactory.createXMLReader(XMLReaderFactory.java:150)
	at org.apache.commons.jocl.JOCLContentHandler.parse(JOCLContentHandler.java:339)
	at org.apache.commons.jocl.JOCLContentHandler.parse(JOCLContentHandler.java:271)
	at org.apache.commons.dbcp.PoolingDriver.getConnectionPool(PoolingDriver.java:116)
	... 31 more


    testCanCloseConnectionTwice :
  java.sql.SQLException
  java.sql.SQLException: Could not parse configuration file
	at org.apache.commons.dbcp.PoolingDriver.getConnectionPool(PoolingDriver.java:119)
	at org.apache.commons.dbcp.PoolingDriver.connect(PoolingDriver.java:175)
	at java.sql.DriverManager.getConnection(DriverManager.java:582)
	at java.sql.DriverManager.getConnection(DriverManager.java:207)
	at org.apache.commons.dbcp.TestJOCLed.getConnection(TestJOCLed.java:43)
	at org.apache.commons.dbcp.TestConnectionPool.newConnection(TestConnectionPool.java:84)
	at org.apache.commons.dbcp.TestConnectionPool.testCanCloseConnectionTwice(TestConnectionPool.java:157)
	at sun.reflect.NativeMethodAccessorImpl.invoke0(Native Method)
	at sun.reflect.NativeMethodAccessorImpl.invoke(NativeMethodAccessorImpl.java:39)
	at sun.reflect.DelegatingMethodAccessorImpl.invoke(DelegatingMethodAccessorImpl.java:25)
	at java.lang.reflect.Method.invoke(Method.java:597)
	at junit.framework.TestCase.runTest(TestCase.java:164)
	at junit.framework.TestCase.runBare(TestCase.java:130)
	at junit.framework.TestResult$1.protect(TestResult.java:106)
	at junit.framework.TestResult.runProtected(TestResult.java:124)
	at junit.framework.TestResult.run(TestResult.java:109)
	at junit.framework.TestCase.run(TestCase.java:120)
	at junit.framework.TestSuite.runTest(TestSuite.java:230)
	at junit.framework.TestSuite.run(TestSuite.java:225)
	at sun.reflect.GeneratedMethodAccessor2.invoke(Unknown Source)
	at sun.reflect.DelegatingMethodAccessorImpl.invoke(DelegatingMethodAccessorImpl.java:25)
	at java.lang.reflect.Method.invoke(Method.java:597)
	at org.apache.maven.surefire.junit.JUnitTestSet.execute(JUnitTestSet.java:213)
	at org.apache.maven.surefire.suite.AbstractDirectoryTestSuite.executeTestSet(AbstractDirectoryTestSuite.java:140)
	at org.apache.maven.surefire.suite.AbstractDirectoryTestSuite.execute(AbstractDirectoryTestSuite.java:127)
	at org.apache.maven.surefire.Surefire.run(Surefire.java:177)
	at sun.reflect.NativeMethodAccessorImpl.invoke0(Native Method)
	at sun.reflect.NativeMethodAccessorImpl.invoke(NativeMethodAccessorImpl.java:39)
	at sun.reflect.DelegatingMethodAccessorImpl.invoke(DelegatingMethodAccessorImpl.java:25)
	at java.lang.reflect.Method.invoke(Method.java:597)
	at org.apache.maven.surefire.booter.SurefireBooter.runSuitesInProcess(SurefireBooter.java:345)
	at org.apache.maven.surefire.booter.SurefireBooter.main(SurefireBooter.java:1009)
Caused by: java.lang.ClassNotFoundException: org.apache.xerces.parsers.SAXParser
	at org.xml.sax.helpers.XMLReaderFactory.loadClass(XMLReaderFactory.java:189)
	at org.xml.sax.helpers.XMLReaderFactory.createXMLReader(XMLReaderFactory.java:150)
	at org.apache.commons.jocl.JOCLContentHandler.parse(JOCLContentHandler.java:339)
	at org.apache.commons.jocl.JOCLContentHandler.parse(JOCLContentHandler.java:271)
	at org.apache.commons.dbcp.PoolingDriver.getConnectionPool(PoolingDriver.java:116)
	... 31 more
Caused by: java.lang.ClassNotFoundException: org.apache.xerces.parsers.SAXParser
	at org.xml.sax.helpers.XMLReaderFactory.loadClass(XMLReaderFactory.java:189)
	at org.xml.sax.helpers.XMLReaderFactory.createXMLReader(XMLReaderFactory.java:150)
	at org.apache.commons.jocl.JOCLContentHandler.parse(JOCLContentHandler.java:339)
	at org.apache.commons.jocl.JOCLContentHandler.parse(JOCLContentHandler.java:271)
	at org.apache.commons.dbcp.PoolingDriver.getConnectionPool(PoolingDriver.java:116)
	... 31 more


    testCanCloseStatementTwice :
  java.sql.SQLException
  java.sql.SQLException: Could not parse configuration file
	at org.apache.commons.dbcp.PoolingDriver.getConnectionPool(PoolingDriver.java:119)
	at org.apache.commons.dbcp.PoolingDriver.connect(PoolingDriver.java:175)
	at java.sql.DriverManager.getConnection(DriverManager.java:582)
	at java.sql.DriverManager.getConnection(DriverManager.java:207)
	at org.apache.commons.dbcp.TestJOCLed.getConnection(TestJOCLed.java:43)
	at org.apache.commons.dbcp.TestConnectionPool.newConnection(TestConnectionPool.java:84)
	at org.apache.commons.dbcp.TestConnectionPool.testCanCloseStatementTwice(TestConnectionPool.java:168)
	at sun.reflect.NativeMethodAccessorImpl.invoke0(Native Method)
	at sun.reflect.NativeMethodAccessorImpl.invoke(NativeMethodAccessorImpl.java:39)
	at sun.reflect.DelegatingMethodAccessorImpl.invoke(DelegatingMethodAccessorImpl.java:25)
	at java.lang.reflect.Method.invoke(Method.java:597)
	at junit.framework.TestCase.runTest(TestCase.java:164)
	at junit.framework.TestCase.runBare(TestCase.java:130)
	at junit.framework.TestResult$1.protect(TestResult.java:106)
	at junit.framework.TestResult.runProtected(TestResult.java:124)
	at junit.framework.TestResult.run(TestResult.java:109)
	at junit.framework.TestCase.run(TestCase.java:120)
	at junit.framework.TestSuite.runTest(TestSuite.java:230)
	at junit.framework.TestSuite.run(TestSuite.java:225)
	at sun.reflect.GeneratedMethodAccessor2.invoke(Unknown Source)
	at sun.reflect.DelegatingMethodAccessorImpl.invoke(DelegatingMethodAccessorImpl.java:25)
	at java.lang.reflect.Method.invoke(Method.java:597)
	at org.apache.maven.surefire.junit.JUnitTestSet.execute(JUnitTestSet.java:213)
	at org.apache.maven.surefire.suite.AbstractDirectoryTestSuite.executeTestSet(AbstractDirectoryTestSuite.java:140)
	at org.apache.maven.surefire.suite.AbstractDirectoryTestSuite.execute(AbstractDirectoryTestSuite.java:127)
	at org.apache.maven.surefire.Surefire.run(Surefire.java:177)
	at sun.reflect.NativeMethodAccessorImpl.invoke0(Native Method)
	at sun.reflect.NativeMethodAccessorImpl.invoke(NativeMethodAccessorImpl.java:39)
	at sun.reflect.DelegatingMethodAccessorImpl.invoke(DelegatingMethodAccessorImpl.java:25)
	at java.lang.reflect.Method.invoke(Method.java:597)
	at org.apache.maven.surefire.booter.SurefireBooter.runSuitesInProcess(SurefireBooter.java:345)
	at org.apache.maven.surefire.booter.SurefireBooter.main(SurefireBooter.java:1009)
Caused by: java.lang.ClassNotFoundException: org.apache.xerces.parsers.SAXParser
	at org.xml.sax.helpers.XMLReaderFactory.loadClass(XMLReaderFactory.java:189)
	at org.xml.sax.helpers.XMLReaderFactory.createXMLReader(XMLReaderFactory.java:150)
	at org.apache.commons.jocl.JOCLContentHandler.parse(JOCLContentHandler.java:339)
	at org.apache.commons.jocl.JOCLContentHandler.parse(JOCLContentHandler.java:271)
	at org.apache.commons.dbcp.PoolingDriver.getConnectionPool(PoolingDriver.java:116)
	... 31 more
Caused by: java.lang.ClassNotFoundException: org.apache.xerces.parsers.SAXParser
	at org.xml.sax.helpers.XMLReaderFactory.loadClass(XMLReaderFactory.java:189)
	at org.xml.sax.helpers.XMLReaderFactory.createXMLReader(XMLReaderFactory.java:150)
	at org.apache.commons.jocl.JOCLContentHandler.parse(JOCLContentHandler.java:339)
	at org.apache.commons.jocl.JOCLContentHandler.parse(JOCLContentHandler.java:271)
	at org.apache.commons.dbcp.PoolingDriver.getConnectionPool(PoolingDriver.java:116)
	... 31 more

    testCanClosePreparedStatementTwice :
  java.sql.SQLException
  java.sql.SQLException: Could not parse configuration file
	at org.apache.commons.dbcp.PoolingDriver.getConnectionPool(PoolingDriver.java:119)
	at org.apache.commons.dbcp.PoolingDriver.connect(PoolingDriver.java:175)
	at java.sql.DriverManager.getConnection(DriverManager.java:582)
	at java.sql.DriverManager.getConnection(DriverManager.java:207)
	at org.apache.commons.dbcp.TestJOCLed.getConnection(TestJOCLed.java:43)
	at org.apache.commons.dbcp.TestConnectionPool.newConnection(TestConnectionPool.java:84)
	at org.apache.commons.dbcp.TestConnectionPool.testCanClosePreparedStatementTwice(TestConnectionPool.java:186)
	at sun.reflect.NativeMethodAccessorImpl.invoke0(Native Method)
	at sun.reflect.NativeMethodAccessorImpl.invoke(NativeMethodAccessorImpl.java:39)
	at sun.reflect.DelegatingMethodAccessorImpl.invoke(DelegatingMethodAccessorImpl.java:25)
	at java.lang.reflect.Method.invoke(Method.java:597)
	at junit.framework.TestCase.runTest(TestCase.java:164)
	at junit.framework.TestCase.runBare(TestCase.java:130)
	at junit.framework.TestResult$1.protect(TestResult.java:106)
	at junit.framework.TestResult.runProtected(TestResult.java:124)
	at junit.framework.TestResult.run(TestResult.java:109)
	at junit.framework.TestCase.run(TestCase.java:120)
	at junit.framework.TestSuite.runTest(TestSuite.java:230)
	at junit.framework.TestSuite.run(TestSuite.java:225)
	at sun.reflect.GeneratedMethodAccessor2.invoke(Unknown Source)
	at sun.reflect.DelegatingMethodAccessorImpl.invoke(DelegatingMethodAccessorImpl.java:25)
	at java.lang.reflect.Method.invoke(Method.java:597)
	at org.apache.maven.surefire.junit.JUnitTestSet.execute(JUnitTestSet.java:213)
	at org.apache.maven.surefire.suite.AbstractDirectoryTestSuite.executeTestSet(AbstractDirectoryTestSuite.java:140)
	at org.apache.maven.surefire.suite.AbstractDirectoryTestSuite.execute(AbstractDirectoryTestSuite.java:127)
	at org.apache.maven.surefire.Surefire.run(Surefire.java:177)
	at sun.reflect.NativeMethodAccessorImpl.invoke0(Native Method)
	at sun.reflect.NativeMethodAccessorImpl.invoke(NativeMethodAccessorImpl.java:39)
	at sun.reflect.DelegatingMethodAccessorImpl.invoke(DelegatingMethodAccessorImpl.java:25)
	at java.lang.reflect.Method.invoke(Method.java:597)
	at org.apache.maven.surefire.booter.SurefireBooter.runSuitesInProcess(SurefireBooter.java:345)
	at org.apache.maven.surefire.booter.SurefireBooter.main(SurefireBooter.java:1009)
Caused by: java.lang.ClassNotFoundException: org.apache.xerces.parsers.SAXParser
	at org.xml.sax.helpers.XMLReaderFactory.loadClass(XMLReaderFactory.java:189)
	at org.xml.sax.helpers.XMLReaderFactory.createXMLReader(XMLReaderFactory.java:150)
	at org.apache.commons.jocl.JOCLContentHandler.parse(JOCLContentHandler.java:339)
	at org.apache.commons.jocl.JOCLContentHandler.parse(JOCLContentHandler.java:271)
	at org.apache.commons.dbcp.PoolingDriver.getConnectionPool(PoolingDriver.java:116)
	... 31 more
Caused by: java.lang.ClassNotFoundException: org.apache.xerces.parsers.SAXParser
	at org.xml.sax.helpers.XMLReaderFactory.loadClass(XMLReaderFactory.java:189)
	at org.xml.sax.helpers.XMLReaderFactory.createXMLReader(XMLReaderFactory.java:150)
	at org.apache.commons.jocl.JOCLContentHandler.parse(JOCLContentHandler.java:339)
	at org.apache.commons.jocl.JOCLContentHandler.parse(JOCLContentHandler.java:271)
	at org.apache.commons.dbcp.PoolingDriver.getConnectionPool(PoolingDriver.java:116)
	... 31 more


    testCanCloseCallableStatementTwice :
  java.sql.SQLException
  java.sql.SQLException: Could not parse configuration file
	at org.apache.commons.dbcp.PoolingDriver.getConnectionPool(PoolingDriver.java:119)
	at org.apache.commons.dbcp.PoolingDriver.connect(PoolingDriver.java:175)
	at java.sql.DriverManager.getConnection(DriverManager.java:582)
	at java.sql.DriverManager.getConnection(DriverManager.java:207)
	at org.apache.commons.dbcp.TestJOCLed.getConnection(TestJOCLed.java:43)
	at org.apache.commons.dbcp.TestConnectionPool.newConnection(TestConnectionPool.java:84)
	at org.apache.commons.dbcp.TestConnectionPool.testCanCloseCallableStatementTwice(TestConnectionPool.java:204)
	at sun.reflect.NativeMethodAccessorImpl.invoke0(Native Method)
	at sun.reflect.NativeMethodAccessorImpl.invoke(NativeMethodAccessorImpl.java:39)
	at sun.reflect.DelegatingMethodAccessorImpl.invoke(DelegatingMethodAccessorImpl.java:25)
	at java.lang.reflect.Method.invoke(Method.java:597)
	at junit.framework.TestCase.runTest(TestCase.java:164)
	at junit.framework.TestCase.runBare(TestCase.java:130)
	at junit.framework.TestResult$1.protect(TestResult.java:106)
	at junit.framework.TestResult.runProtected(TestResult.java:124)
	at junit.framework.TestResult.run(TestResult.java:109)
	at junit.framework.TestCase.run(TestCase.java:120)
	at junit.framework.TestSuite.runTest(TestSuite.java:230)
	at junit.framework.TestSuite.run(TestSuite.java:225)
	at sun.reflect.GeneratedMethodAccessor2.invoke(Unknown Source)
	at sun.reflect.DelegatingMethodAccessorImpl.invoke(DelegatingMethodAccessorImpl.java:25)
	at java.lang.reflect.Method.invoke(Method.java:597)
	at org.apache.maven.surefire.junit.JUnitTestSet.execute(JUnitTestSet.java:213)
	at org.apache.maven.surefire.suite.AbstractDirectoryTestSuite.executeTestSet(AbstractDirectoryTestSuite.java:140)
	at org.apache.maven.surefire.suite.AbstractDirectoryTestSuite.execute(AbstractDirectoryTestSuite.java:127)
	at org.apache.maven.surefire.Surefire.run(Surefire.java:177)
	at sun.reflect.NativeMethodAccessorImpl.invoke0(Native Method)
	at sun.reflect.NativeMethodAccessorImpl.invoke(NativeMethodAccessorImpl.java:39)
	at sun.reflect.DelegatingMethodAccessorImpl.invoke(DelegatingMethodAccessorImpl.java:25)
	at java.lang.reflect.Method.invoke(Method.java:597)
	at org.apache.maven.surefire.booter.SurefireBooter.runSuitesInProcess(SurefireBooter.java:345)
	at org.apache.maven.surefire.booter.SurefireBooter.main(SurefireBooter.java:1009)
Caused by: java.lang.ClassNotFoundException: org.apache.xerces.parsers.SAXParser
	at org.xml.sax.helpers.XMLReaderFactory.loadClass(XMLReaderFactory.java:189)
	at org.xml.sax.helpers.XMLReaderFactory.createXMLReader(XMLReaderFactory.java:150)
	at org.apache.commons.jocl.JOCLContentHandler.parse(JOCLContentHandler.java:339)
	at org.apache.commons.jocl.JOCLContentHandler.parse(JOCLContentHandler.java:271)
	at org.apache.commons.dbcp.PoolingDriver.getConnectionPool(PoolingDriver.java:116)
	... 31 more
Caused by: java.lang.ClassNotFoundException: org.apache.xerces.parsers.SAXParser
	at org.xml.sax.helpers.XMLReaderFactory.loadClass(XMLReaderFactory.java:189)
	at org.xml.sax.helpers.XMLReaderFactory.createXMLReader(XMLReaderFactory.java:150)
	at org.apache.commons.jocl.JOCLContentHandler.parse(JOCLContentHandler.java:339)
	at org.apache.commons.jocl.JOCLContentHandler.parse(JOCLContentHandler.java:271)
	at org.apache.commons.dbcp.PoolingDriver.getConnectionPool(PoolingDriver.java:116)
	... 31 more

    testCanCloseResultSetTwice :
  java.sql.SQLException
  java.sql.SQLException: Could not parse configuration file
	at org.apache.commons.dbcp.PoolingDriver.getConnectionPool(PoolingDriver.java:119)
	at org.apache.commons.dbcp.PoolingDriver.connect(PoolingDriver.java:175)
	at java.sql.DriverManager.getConnection(DriverManager.java:582)
	at java.sql.DriverManager.getConnection(DriverManager.java:207)
	at org.apache.commons.dbcp.TestJOCLed.getConnection(TestJOCLed.java:43)
	at org.apache.commons.dbcp.TestConnectionPool.newConnection(TestConnectionPool.java:84)
	at org.apache.commons.dbcp.TestConnectionPool.testCanCloseResultSetTwice(TestConnectionPool.java:222)
	at sun.reflect.NativeMethodAccessorImpl.invoke0(Native Method)
	at sun.reflect.NativeMethodAccessorImpl.invoke(NativeMethodAccessorImpl.java:39)
	at sun.reflect.DelegatingMethodAccessorImpl.invoke(DelegatingMethodAccessorImpl.java:25)
	at java.lang.reflect.Method.invoke(Method.java:597)
	at junit.framework.TestCase.runTest(TestCase.java:164)
	at junit.framework.TestCase.runBare(TestCase.java:130)
	at junit.framework.TestResult$1.protect(TestResult.java:106)
	at junit.framework.TestResult.runProtected(TestResult.java:124)
	at junit.framework.TestResult.run(TestResult.java:109)
	at junit.framework.TestCase.run(TestCase.java:120)
	at junit.framework.TestSuite.runTest(TestSuite.java:230)
	at junit.framework.TestSuite.run(TestSuite.java:225)
	at sun.reflect.GeneratedMethodAccessor2.invoke(Unknown Source)
	at sun.reflect.DelegatingMethodAccessorImpl.invoke(DelegatingMethodAccessorImpl.java:25)
	at java.lang.reflect.Method.invoke(Method.java:597)
	at org.apache.maven.surefire.junit.JUnitTestSet.execute(JUnitTestSet.java:213)
	at org.apache.maven.surefire.suite.AbstractDirectoryTestSuite.executeTestSet(AbstractDirectoryTestSuite.java:140)
	at org.apache.maven.surefire.suite.AbstractDirectoryTestSuite.execute(AbstractDirectoryTestSuite.java:127)
	at org.apache.maven.surefire.Surefire.run(Surefire.java:177)
	at sun.reflect.NativeMethodAccessorImpl.invoke0(Native Method)
	at sun.reflect.NativeMethodAccessorImpl.invoke(NativeMethodAccessorImpl.java:39)
	at sun.reflect.DelegatingMethodAccessorImpl.invoke(DelegatingMethodAccessorImpl.java:25)
	at java.lang.reflect.Method.invoke(Method.java:597)
	at org.apache.maven.surefire.booter.SurefireBooter.runSuitesInProcess(SurefireBooter.java:345)
	at org.apache.maven.surefire.booter.SurefireBooter.main(SurefireBooter.java:1009)
Caused by: java.lang.ClassNotFoundException: org.apache.xerces.parsers.SAXParser
	at org.xml.sax.helpers.XMLReaderFactory.loadClass(XMLReaderFactory.java:189)
	at org.xml.sax.helpers.XMLReaderFactory.createXMLReader(XMLReaderFactory.java:150)
	at org.apache.commons.jocl.JOCLContentHandler.parse(JOCLContentHandler.java:339)
	at org.apache.commons.jocl.JOCLContentHandler.parse(JOCLContentHandler.java:271)
	at org.apache.commons.dbcp.PoolingDriver.getConnectionPool(PoolingDriver.java:116)
	... 31 more
Caused by: java.lang.ClassNotFoundException: org.apache.xerces.parsers.SAXParser
	at org.xml.sax.helpers.XMLReaderFactory.loadClass(XMLReaderFactory.java:189)
	at org.xml.sax.helpers.XMLReaderFactory.createXMLReader(XMLReaderFactory.java:150)
	at org.apache.commons.jocl.JOCLContentHandler.parse(JOCLContentHandler.java:339)
	at org.apache.commons.jocl.JOCLContentHandler.parse(JOCLContentHandler.java:271)
	at org.apache.commons.dbcp.PoolingDriver.getConnectionPool(PoolingDriver.java:116)
	... 31 more


    testBackPointers :
  java.sql.SQLException
  java.sql.SQLException: Could not parse configuration file
	at org.apache.commons.dbcp.PoolingDriver.getConnectionPool(PoolingDriver.java:119)
	at org.apache.commons.dbcp.PoolingDriver.connect(PoolingDriver.java:175)
	at java.sql.DriverManager.getConnection(DriverManager.java:582)
	at java.sql.DriverManager.getConnection(DriverManager.java:207)
	at org.apache.commons.dbcp.TestJOCLed.getConnection(TestJOCLed.java:43)
	at org.apache.commons.dbcp.TestConnectionPool.newConnection(TestConnectionPool.java:84)
	at org.apache.commons.dbcp.TestConnectionPool.testBackPointers(TestConnectionPool.java:243)
	at sun.reflect.NativeMethodAccessorImpl.invoke0(Native Method)
	at sun.reflect.NativeMethodAccessorImpl.invoke(NativeMethodAccessorImpl.java:39)
	at sun.reflect.DelegatingMethodAccessorImpl.invoke(DelegatingMethodAccessorImpl.java:25)
	at java.lang.reflect.Method.invoke(Method.java:597)
	at junit.framework.TestCase.runTest(TestCase.java:164)
	at junit.framework.TestCase.runBare(TestCase.java:130)
	at junit.framework.TestResult$1.protect(TestResult.java:106)
	at junit.framework.TestResult.runProtected(TestResult.java:124)
	at junit.framework.TestResult.run(TestResult.java:109)
	at junit.framework.TestCase.run(TestCase.java:120)
	at junit.framework.TestSuite.runTest(TestSuite.java:230)
	at junit.framework.TestSuite.run(TestSuite.java:225)
	at sun.reflect.GeneratedMethodAccessor2.invoke(Unknown Source)
	at sun.reflect.DelegatingMethodAccessorImpl.invoke(DelegatingMethodAccessorImpl.java:25)
	at java.lang.reflect.Method.invoke(Method.java:597)
	at org.apache.maven.surefire.junit.JUnitTestSet.execute(JUnitTestSet.java:213)
	at org.apache.maven.surefire.suite.AbstractDirectoryTestSuite.executeTestSet(AbstractDirectoryTestSuite.java:140)
	at org.apache.maven.surefire.suite.AbstractDirectoryTestSuite.execute(AbstractDirectoryTestSuite.java:127)
	at org.apache.maven.surefire.Surefire.run(Surefire.java:177)
	at sun.reflect.NativeMethodAccessorImpl.invoke0(Native Method)
	at sun.reflect.NativeMethodAccessorImpl.invoke(NativeMethodAccessorImpl.java:39)
	at sun.reflect.DelegatingMethodAccessorImpl.invoke(DelegatingMethodAccessorImpl.java:25)
	at java.lang.reflect.Method.invoke(Method.java:597)
	at org.apache.maven.surefire.booter.SurefireBooter.runSuitesInProcess(SurefireBooter.java:345)
	at org.apache.maven.surefire.booter.SurefireBooter.main(SurefireBooter.java:1009)
Caused by: java.lang.ClassNotFoundException: org.apache.xerces.parsers.SAXParser
	at org.xml.sax.helpers.XMLReaderFactory.loadClass(XMLReaderFactory.java:189)
	at org.xml.sax.helpers.XMLReaderFactory.createXMLReader(XMLReaderFactory.java:150)
	at org.apache.commons.jocl.JOCLContentHandler.parse(JOCLContentHandler.java:339)
	at org.apache.commons.jocl.JOCLContentHandler.parse(JOCLContentHandler.java:271)
	at org.apache.commons.dbcp.PoolingDriver.getConnectionPool(PoolingDriver.java:116)
	... 31 more
Caused by: java.lang.ClassNotFoundException: org.apache.xerces.parsers.SAXParser
	at org.xml.sax.helpers.XMLReaderFactory.loadClass(XMLReaderFactory.java:189)
	at org.xml.sax.helpers.XMLReaderFactory.createXMLReader(XMLReaderFactory.java:150)
	at org.apache.commons.jocl.JOCLContentHandler.parse(JOCLContentHandler.java:339)
	at org.apache.commons.jocl.JOCLContentHandler.parse(JOCLContentHandler.java:271)
	at org.apache.commons.dbcp.PoolingDriver.getConnectionPool(PoolingDriver.java:116)
	... 31 more

    testSimple :
  java.sql.SQLException
  java.sql.SQLException: Could not parse configuration file
	at org.apache.commons.dbcp.PoolingDriver.getConnectionPool(PoolingDriver.java:119)
	at org.apache.commons.dbcp.PoolingDriver.connect(PoolingDriver.java:175)
	at java.sql.DriverManager.getConnection(DriverManager.java:582)
	at java.sql.DriverManager.getConnection(DriverManager.java:207)
	at org.apache.commons.dbcp.TestJOCLed.getConnection(TestJOCLed.java:43)
	at org.apache.commons.dbcp.TestConnectionPool.newConnection(TestConnectionPool.java:84)
	at org.apache.commons.dbcp.TestConnectionPool.testSimple(TestConnectionPool.java:317)
	at sun.reflect.NativeMethodAccessorImpl.invoke0(Native Method)
	at sun.reflect.NativeMethodAccessorImpl.invoke(NativeMethodAccessorImpl.java:39)
	at sun.reflect.DelegatingMethodAccessorImpl.invoke(DelegatingMethodAccessorImpl.java:25)
	at java.lang.reflect.Method.invoke(Method.java:597)
	at junit.framework.TestCase.runTest(TestCase.java:164)
	at junit.framework.TestCase.runBare(TestCase.java:130)
	at junit.framework.TestResult$1.protect(TestResult.java:106)
	at junit.framework.TestResult.runProtected(TestResult.java:124)
	at junit.framework.TestResult.run(TestResult.java:109)
	at junit.framework.TestCase.run(TestCase.java:120)
	at junit.framework.TestSuite.runTest(TestSuite.java:230)
	at junit.framework.TestSuite.run(TestSuite.java:225)
	at sun.reflect.GeneratedMethodAccessor2.invoke(Unknown Source)
	at sun.reflect.DelegatingMethodAccessorImpl.invoke(DelegatingMethodAccessorImpl.java:25)
	at java.lang.reflect.Method.invoke(Method.java:597)
	at org.apache.maven.surefire.junit.JUnitTestSet.execute(JUnitTestSet.java:213)
	at org.apache.maven.surefire.suite.AbstractDirectoryTestSuite.executeTestSet(AbstractDirectoryTestSuite.java:140)
	at org.apache.maven.surefire.suite.AbstractDirectoryTestSuite.execute(AbstractDirectoryTestSuite.java:127)
	at org.apache.maven.surefire.Surefire.run(Surefire.java:177)
	at sun.reflect.NativeMethodAccessorImpl.invoke0(Native Method)
	at sun.reflect.NativeMethodAccessorImpl.invoke(NativeMethodAccessorImpl.java:39)
	at sun.reflect.DelegatingMethodAccessorImpl.invoke(DelegatingMethodAccessorImpl.java:25)
	at java.lang.reflect.Method.invoke(Method.java:597)
	at org.apache.maven.surefire.booter.SurefireBooter.runSuitesInProcess(SurefireBooter.java:345)
	at org.apache.maven.surefire.booter.SurefireBooter.main(SurefireBooter.java:1009)
Caused by: java.lang.ClassNotFoundException: org.apache.xerces.parsers.SAXParser
	at org.xml.sax.helpers.XMLReaderFactory.loadClass(XMLReaderFactory.java:189)
	at org.xml.sax.helpers.XMLReaderFactory.createXMLReader(XMLReaderFactory.java:150)
	at org.apache.commons.jocl.JOCLContentHandler.parse(JOCLContentHandler.java:339)
	at org.apache.commons.jocl.JOCLContentHandler.parse(JOCLContentHandler.java:271)
	at org.apache.commons.dbcp.PoolingDriver.getConnectionPool(PoolingDriver.java:116)
	... 31 more
Caused by: java.lang.ClassNotFoundException: org.apache.xerces.parsers.SAXParser
	at org.xml.sax.helpers.XMLReaderFactory.loadClass(XMLReaderFactory.java:189)
	at org.xml.sax.helpers.XMLReaderFactory.createXMLReader(XMLReaderFactory.java:150)
	at org.apache.commons.jocl.JOCLContentHandler.parse(JOCLContentHandler.java:339)
	at org.apache.commons.jocl.JOCLContentHandler.parse(JOCLContentHandler.java:271)
	at org.apache.commons.dbcp.PoolingDriver.getConnectionPool(PoolingDriver.java:116)
	... 31 more


    testRepeatedBorrowAndReturn :
  java.sql.SQLException
  java.sql.SQLException: Could not parse configuration file
	at org.apache.commons.dbcp.PoolingDriver.getConnectionPool(PoolingDriver.java:119)
	at org.apache.commons.dbcp.PoolingDriver.connect(PoolingDriver.java:175)
	at java.sql.DriverManager.getConnection(DriverManager.java:582)
	at java.sql.DriverManager.getConnection(DriverManager.java:207)
	at org.apache.commons.dbcp.TestJOCLed.getConnection(TestJOCLed.java:43)
	at org.apache.commons.dbcp.TestConnectionPool.newConnection(TestConnectionPool.java:84)
	at org.apache.commons.dbcp.TestConnectionPool.testRepeatedBorrowAndReturn(TestConnectionPool.java:331)
	at sun.reflect.NativeMethodAccessorImpl.invoke0(Native Method)
	at sun.reflect.NativeMethodAccessorImpl.invoke(NativeMethodAccessorImpl.java:39)
	at sun.reflect.DelegatingMethodAccessorImpl.invoke(DelegatingMethodAccessorImpl.java:25)
	at java.lang.reflect.Method.invoke(Method.java:597)
	at junit.framework.TestCase.runTest(TestCase.java:164)
	at junit.framework.TestCase.runBare(TestCase.java:130)
	at junit.framework.TestResult$1.protect(TestResult.java:106)
	at junit.framework.TestResult.runProtected(TestResult.java:124)
	at junit.framework.TestResult.run(TestResult.java:109)
	at junit.framework.TestCase.run(TestCase.java:120)
	at junit.framework.TestSuite.runTest(TestSuite.java:230)
	at junit.framework.TestSuite.run(TestSuite.java:225)
	at sun.reflect.GeneratedMethodAccessor2.invoke(Unknown Source)
	at sun.reflect.DelegatingMethodAccessorImpl.invoke(DelegatingMethodAccessorImpl.java:25)
	at java.lang.reflect.Method.invoke(Method.java:597)
	at org.apache.maven.surefire.junit.JUnitTestSet.execute(JUnitTestSet.java:213)
	at org.apache.maven.surefire.suite.AbstractDirectoryTestSuite.executeTestSet(AbstractDirectoryTestSuite.java:140)
	at org.apache.maven.surefire.suite.AbstractDirectoryTestSuite.execute(AbstractDirectoryTestSuite.java:127)
	at org.apache.maven.surefire.Surefire.run(Surefire.java:177)
	at sun.reflect.NativeMethodAccessorImpl.invoke0(Native Method)
	at sun.reflect.NativeMethodAccessorImpl.invoke(NativeMethodAccessorImpl.java:39)
	at sun.reflect.DelegatingMethodAccessorImpl.invoke(DelegatingMethodAccessorImpl.java:25)
	at java.lang.reflect.Method.invoke(Method.java:597)
	at org.apache.maven.surefire.booter.SurefireBooter.runSuitesInProcess(SurefireBooter.java:345)
	at org.apache.maven.surefire.booter.SurefireBooter.main(SurefireBooter.java:1009)
Caused by: java.lang.ClassNotFoundException: org.apache.xerces.parsers.SAXParser
	at org.xml.sax.helpers.XMLReaderFactory.loadClass(XMLReaderFactory.java:189)
	at org.xml.sax.helpers.XMLReaderFactory.createXMLReader(XMLReaderFactory.java:150)
	at org.apache.commons.jocl.JOCLContentHandler.parse(JOCLContentHandler.java:339)
	at org.apache.commons.jocl.JOCLContentHandler.parse(JOCLContentHandler.java:271)
	at org.apache.commons.dbcp.PoolingDriver.getConnectionPool(PoolingDriver.java:116)
	... 31 more
Caused by: java.lang.ClassNotFoundException: org.apache.xerces.parsers.SAXParser
	at org.xml.sax.helpers.XMLReaderFactory.loadClass(XMLReaderFactory.java:189)
	at org.xml.sax.helpers.XMLReaderFactory.createXMLReader(XMLReaderFactory.java:150)
	at org.apache.commons.jocl.JOCLContentHandler.parse(JOCLContentHandler.java:339)
	at org.apache.commons.jocl.JOCLContentHandler.parse(JOCLContentHandler.java:271)
	at org.apache.commons.dbcp.PoolingDriver.getConnectionPool(PoolingDriver.java:116)
	... 31 more

    testSimple2 :
  java.sql.SQLException
  java.sql.SQLException: Could not parse configuration file
	at org.apache.commons.dbcp.PoolingDriver.getConnectionPool(PoolingDriver.java:119)
	at org.apache.commons.dbcp.PoolingDriver.connect(PoolingDriver.java:175)
	at java.sql.DriverManager.getConnection(DriverManager.java:582)
	at java.sql.DriverManager.getConnection(DriverManager.java:207)
	at org.apache.commons.dbcp.TestJOCLed.getConnection(TestJOCLed.java:43)
	at org.apache.commons.dbcp.TestConnectionPool.newConnection(TestConnectionPool.java:84)
	at org.apache.commons.dbcp.TestConnectionPool.testSimple2(TestConnectionPool.java:345)
	at sun.reflect.NativeMethodAccessorImpl.invoke0(Native Method)
	at sun.reflect.NativeMethodAccessorImpl.invoke(NativeMethodAccessorImpl.java:39)
	at sun.reflect.DelegatingMethodAccessorImpl.invoke(DelegatingMethodAccessorImpl.java:25)
	at java.lang.reflect.Method.invoke(Method.java:597)
	at junit.framework.TestCase.runTest(TestCase.java:164)
	at junit.framework.TestCase.runBare(TestCase.java:130)
	at junit.framework.TestResult$1.protect(TestResult.java:106)
	at junit.framework.TestResult.runProtected(TestResult.java:124)
	at junit.framework.TestResult.run(TestResult.java:109)
	at junit.framework.TestCase.run(TestCase.java:120)
	at junit.framework.TestSuite.runTest(TestSuite.java:230)
	at junit.framework.TestSuite.run(TestSuite.java:225)
	at sun.reflect.GeneratedMethodAccessor2.invoke(Unknown Source)
	at sun.reflect.DelegatingMethodAccessorImpl.invoke(DelegatingMethodAccessorImpl.java:25)
	at java.lang.reflect.Method.invoke(Method.java:597)
	at org.apache.maven.surefire.junit.JUnitTestSet.execute(JUnitTestSet.java:213)
	at org.apache.maven.surefire.suite.AbstractDirectoryTestSuite.executeTestSet(AbstractDirectoryTestSuite.java:140)
	at org.apache.maven.surefire.suite.AbstractDirectoryTestSuite.execute(AbstractDirectoryTestSuite.java:127)
	at org.apache.maven.surefire.Surefire.run(Surefire.java:177)
	at sun.reflect.NativeMethodAccessorImpl.invoke0(Native Method)
	at sun.reflect.NativeMethodAccessorImpl.invoke(NativeMethodAccessorImpl.java:39)
	at sun.reflect.DelegatingMethodAccessorImpl.invoke(DelegatingMethodAccessorImpl.java:25)
	at java.lang.reflect.Method.invoke(Method.java:597)
	at org.apache.maven.surefire.booter.SurefireBooter.runSuitesInProcess(SurefireBooter.java:345)
	at org.apache.maven.surefire.booter.SurefireBooter.main(SurefireBooter.java:1009)
Caused by: java.lang.ClassNotFoundException: org.apache.xerces.parsers.SAXParser
	at org.xml.sax.helpers.XMLReaderFactory.loadClass(XMLReaderFactory.java:189)
	at org.xml.sax.helpers.XMLReaderFactory.createXMLReader(XMLReaderFactory.java:150)
	at org.apache.commons.jocl.JOCLContentHandler.parse(JOCLContentHandler.java:339)
	at org.apache.commons.jocl.JOCLContentHandler.parse(JOCLContentHandler.java:271)
	at org.apache.commons.dbcp.PoolingDriver.getConnectionPool(PoolingDriver.java:116)
	... 31 more
Caused by: java.lang.ClassNotFoundException: org.apache.xerces.parsers.SAXParser
	at org.xml.sax.helpers.XMLReaderFactory.loadClass(XMLReaderFactory.java:189)
	at org.xml.sax.helpers.XMLReaderFactory.createXMLReader(XMLReaderFactory.java:150)
	at org.apache.commons.jocl.JOCLContentHandler.parse(JOCLContentHandler.java:339)
	at org.apache.commons.jocl.JOCLContentHandler.parse(JOCLContentHandler.java:271)
	at org.apache.commons.dbcp.PoolingDriver.getConnectionPool(PoolingDriver.java:116)
	... 31 more


    testAutoCommitBehavior :
  java.sql.SQLException
  java.sql.SQLException: Could not parse configuration file
	at org.apache.commons.dbcp.PoolingDriver.getConnectionPool(PoolingDriver.java:119)
	at org.apache.commons.dbcp.PoolingDriver.connect(PoolingDriver.java:175)
	at java.sql.DriverManager.getConnection(DriverManager.java:582)
	at java.sql.DriverManager.getConnection(DriverManager.java:207)
	at org.apache.commons.dbcp.TestJOCLed.getConnection(TestJOCLed.java:43)
	at org.apache.commons.dbcp.TestConnectionPool.newConnection(TestConnectionPool.java:84)
	at org.apache.commons.dbcp.TestConnectionPool.testAutoCommitBehavior(TestConnectionPool.java:433)
	at sun.reflect.NativeMethodAccessorImpl.invoke0(Native Method)
	at sun.reflect.NativeMethodAccessorImpl.invoke(NativeMethodAccessorImpl.java:39)
	at sun.reflect.DelegatingMethodAccessorImpl.invoke(DelegatingMethodAccessorImpl.java:25)
	at java.lang.reflect.Method.invoke(Method.java:597)
	at junit.framework.TestCase.runTest(TestCase.java:164)
	at junit.framework.TestCase.runBare(TestCase.java:130)
	at junit.framework.TestResult$1.protect(TestResult.java:106)
	at junit.framework.TestResult.runProtected(TestResult.java:124)
	at junit.framework.TestResult.run(TestResult.java:109)
	at junit.framework.TestCase.run(TestCase.java:120)
	at junit.framework.TestSuite.runTest(TestSuite.java:230)
	at junit.framework.TestSuite.run(TestSuite.java:225)
	at sun.reflect.GeneratedMethodAccessor2.invoke(Unknown Source)
	at sun.reflect.DelegatingMethodAccessorImpl.invoke(DelegatingMethodAccessorImpl.java:25)
	at java.lang.reflect.Method.invoke(Method.java:597)
	at org.apache.maven.surefire.junit.JUnitTestSet.execute(JUnitTestSet.java:213)
	at org.apache.maven.surefire.suite.AbstractDirectoryTestSuite.executeTestSet(AbstractDirectoryTestSuite.java:140)
	at org.apache.maven.surefire.suite.AbstractDirectoryTestSuite.execute(AbstractDirectoryTestSuite.java:127)
	at org.apache.maven.surefire.Surefire.run(Surefire.java:177)
	at sun.reflect.NativeMethodAccessorImpl.invoke0(Native Method)
	at sun.reflect.NativeMethodAccessorImpl.invoke(NativeMethodAccessorImpl.java:39)
	at sun.reflect.DelegatingMethodAccessorImpl.invoke(DelegatingMethodAccessorImpl.java:25)
	at java.lang.reflect.Method.invoke(Method.java:597)
	at org.apache.maven.surefire.booter.SurefireBooter.runSuitesInProcess(SurefireBooter.java:345)
	at org.apache.maven.surefire.booter.SurefireBooter.main(SurefireBooter.java:1009)
Caused by: java.lang.ClassNotFoundException: org.apache.xerces.parsers.SAXParser
	at org.xml.sax.helpers.XMLReaderFactory.loadClass(XMLReaderFactory.java:189)
	at org.xml.sax.helpers.XMLReaderFactory.createXMLReader(XMLReaderFactory.java:150)
	at org.apache.commons.jocl.JOCLContentHandler.parse(JOCLContentHandler.java:339)
	at org.apache.commons.jocl.JOCLContentHandler.parse(JOCLContentHandler.java:271)
	at org.apache.commons.dbcp.PoolingDriver.getConnectionPool(PoolingDriver.java:116)
	... 31 more
Caused by: java.lang.ClassNotFoundException: org.apache.xerces.parsers.SAXParser
	at org.xml.sax.helpers.XMLReaderFactory.loadClass(XMLReaderFactory.java:189)
	at org.xml.sax.helpers.XMLReaderFactory.createXMLReader(XMLReaderFactory.java:150)
	at org.apache.commons.jocl.JOCLContentHandler.parse(JOCLContentHandler.java:339)
	at org.apache.commons.jocl.JOCLContentHandler.parse(JOCLContentHandler.java:271)
	at org.apache.commons.dbcp.PoolingDriver.getConnectionPool(PoolingDriver.java:116)
	... 31 more


    testConnectionsAreDistinct :
  java.sql.SQLException
  java.sql.SQLException: Could not parse configuration file
	at org.apache.commons.dbcp.PoolingDriver.getConnectionPool(PoolingDriver.java:119)
	at org.apache.commons.dbcp.PoolingDriver.connect(PoolingDriver.java:175)
	at java.sql.DriverManager.getConnection(DriverManager.java:582)
	at java.sql.DriverManager.getConnection(DriverManager.java:207)
	at org.apache.commons.dbcp.TestJOCLed.getConnection(TestJOCLed.java:43)
	at org.apache.commons.dbcp.TestConnectionPool.newConnection(TestConnectionPool.java:84)
	at org.apache.commons.dbcp.TestConnectionPool.testConnectionsAreDistinct(TestConnectionPool.java:454)
	at sun.reflect.NativeMethodAccessorImpl.invoke0(Native Method)
	at sun.reflect.NativeMethodAccessorImpl.invoke(NativeMethodAccessorImpl.java:39)
	at sun.reflect.DelegatingMethodAccessorImpl.invoke(DelegatingMethodAccessorImpl.java:25)
	at java.lang.reflect.Method.invoke(Method.java:597)
	at junit.framework.TestCase.runTest(TestCase.java:164)
	at junit.framework.TestCase.runBare(TestCase.java:130)
	at junit.framework.TestResult$1.protect(TestResult.java:106)
	at junit.framework.TestResult.runProtected(TestResult.java:124)
	at junit.framework.TestResult.run(TestResult.java:109)
	at junit.framework.TestCase.run(TestCase.java:120)
	at junit.framework.TestSuite.runTest(TestSuite.java:230)
	at junit.framework.TestSuite.run(TestSuite.java:225)
	at sun.reflect.GeneratedMethodAccessor2.invoke(Unknown Source)
	at sun.reflect.DelegatingMethodAccessorImpl.invoke(DelegatingMethodAccessorImpl.java:25)
	at java.lang.reflect.Method.invoke(Method.java:597)
	at org.apache.maven.surefire.junit.JUnitTestSet.execute(JUnitTestSet.java:213)
	at org.apache.maven.surefire.suite.AbstractDirectoryTestSuite.executeTestSet(AbstractDirectoryTestSuite.java:140)
	at org.apache.maven.surefire.suite.AbstractDirectoryTestSuite.execute(AbstractDirectoryTestSuite.java:127)
	at org.apache.maven.surefire.Surefire.run(Surefire.java:177)
	at sun.reflect.NativeMethodAccessorImpl.invoke0(Native Method)
	at sun.reflect.NativeMethodAccessorImpl.invoke(NativeMethodAccessorImpl.java:39)
	at sun.reflect.DelegatingMethodAccessorImpl.invoke(DelegatingMethodAccessorImpl.java:25)
	at java.lang.reflect.Method.invoke(Method.java:597)
	at org.apache.maven.surefire.booter.SurefireBooter.runSuitesInProcess(SurefireBooter.java:345)
	at org.apache.maven.surefire.booter.SurefireBooter.main(SurefireBooter.java:1009)
Caused by: java.lang.ClassNotFoundException: org.apache.xerces.parsers.SAXParser
	at org.xml.sax.helpers.XMLReaderFactory.loadClass(XMLReaderFactory.java:189)
	at org.xml.sax.helpers.XMLReaderFactory.createXMLReader(XMLReaderFactory.java:150)
	at org.apache.commons.jocl.JOCLContentHandler.parse(JOCLContentHandler.java:339)
	at org.apache.commons.jocl.JOCLContentHandler.parse(JOCLContentHandler.java:271)
	at org.apache.commons.dbcp.PoolingDriver.getConnectionPool(PoolingDriver.java:116)
	... 31 more
Caused by: java.lang.ClassNotFoundException: org.apache.xerces.parsers.SAXParser
	at org.xml.sax.helpers.XMLReaderFactory.loadClass(XMLReaderFactory.java:189)
	at org.xml.sax.helpers.XMLReaderFactory.createXMLReader(XMLReaderFactory.java:150)
	at org.apache.commons.jocl.JOCLContentHandler.parse(JOCLContentHandler.java:339)
	at org.apache.commons.jocl.JOCLContentHandler.parse(JOCLContentHandler.java:271)
	at org.apache.commons.dbcp.PoolingDriver.getConnectionPool(PoolingDriver.java:116)
	... 31 more

    testOpening :
  java.sql.SQLException
  java.sql.SQLException: Could not parse configuration file
	at org.apache.commons.dbcp.PoolingDriver.getConnectionPool(PoolingDriver.java:119)
	at org.apache.commons.dbcp.PoolingDriver.connect(PoolingDriver.java:175)
	at java.sql.DriverManager.getConnection(DriverManager.java:582)
	at java.sql.DriverManager.getConnection(DriverManager.java:207)
	at org.apache.commons.dbcp.TestJOCLed.getConnection(TestJOCLed.java:43)
	at org.apache.commons.dbcp.TestConnectionPool.newConnection(TestConnectionPool.java:84)
	at org.apache.commons.dbcp.TestConnectionPool.testOpening(TestConnectionPool.java:470)
	at sun.reflect.NativeMethodAccessorImpl.invoke0(Native Method)
	at sun.reflect.NativeMethodAccessorImpl.invoke(NativeMethodAccessorImpl.java:39)
	at sun.reflect.DelegatingMethodAccessorImpl.invoke(DelegatingMethodAccessorImpl.java:25)
	at java.lang.reflect.Method.invoke(Method.java:597)
	at junit.framework.TestCase.runTest(TestCase.java:164)
	at junit.framework.TestCase.runBare(TestCase.java:130)
	at junit.framework.TestResult$1.protect(TestResult.java:106)
	at junit.framework.TestResult.runProtected(TestResult.java:124)
	at junit.framework.TestResult.run(TestResult.java:109)
	at junit.framework.TestCase.run(TestCase.java:120)
	at junit.framework.TestSuite.runTest(TestSuite.java:230)
	at junit.framework.TestSuite.run(TestSuite.java:225)
	at sun.reflect.GeneratedMethodAccessor2.invoke(Unknown Source)
	at sun.reflect.DelegatingMethodAccessorImpl.invoke(DelegatingMethodAccessorImpl.java:25)
	at java.lang.reflect.Method.invoke(Method.java:597)
	at org.apache.maven.surefire.junit.JUnitTestSet.execute(JUnitTestSet.java:213)
	at org.apache.maven.surefire.suite.AbstractDirectoryTestSuite.executeTestSet(AbstractDirectoryTestSuite.java:140)
	at org.apache.maven.surefire.suite.AbstractDirectoryTestSuite.execute(AbstractDirectoryTestSuite.java:127)
	at org.apache.maven.surefire.Surefire.run(Surefire.java:177)
	at sun.reflect.NativeMethodAccessorImpl.invoke0(Native Method)
	at sun.reflect.NativeMethodAccessorImpl.invoke(NativeMethodAccessorImpl.java:39)
	at sun.reflect.DelegatingMethodAccessorImpl.invoke(DelegatingMethodAccessorImpl.java:25)
	at java.lang.reflect.Method.invoke(Method.java:597)
	at org.apache.maven.surefire.booter.SurefireBooter.runSuitesInProcess(SurefireBooter.java:345)
	at org.apache.maven.surefire.booter.SurefireBooter.main(SurefireBooter.java:1009)
Caused by: java.lang.ClassNotFoundException: org.apache.xerces.parsers.SAXParser
	at org.xml.sax.helpers.XMLReaderFactory.loadClass(XMLReaderFactory.java:189)
	at org.xml.sax.helpers.XMLReaderFactory.createXMLReader(XMLReaderFactory.java:150)
	at org.apache.commons.jocl.JOCLContentHandler.parse(JOCLContentHandler.java:339)
	at org.apache.commons.jocl.JOCLContentHandler.parse(JOCLContentHandler.java:271)
	at org.apache.commons.dbcp.PoolingDriver.getConnectionPool(PoolingDriver.java:116)
	... 31 more
Caused by: java.lang.ClassNotFoundException: org.apache.xerces.parsers.SAXParser
	at org.xml.sax.helpers.XMLReaderFactory.loadClass(XMLReaderFactory.java:189)
	at org.xml.sax.helpers.XMLReaderFactory.createXMLReader(XMLReaderFactory.java:150)
	at org.apache.commons.jocl.JOCLContentHandler.parse(JOCLContentHandler.java:339)
	at org.apache.commons.jocl.JOCLContentHandler.parse(JOCLContentHandler.java:271)
	at org.apache.commons.dbcp.PoolingDriver.getConnectionPool(PoolingDriver.java:116)
	... 31 more


    testClosing :
  java.sql.SQLException
  java.sql.SQLException: Could not parse configuration file
	at org.apache.commons.dbcp.PoolingDriver.getConnectionPool(PoolingDriver.java:119)
	at org.apache.commons.dbcp.PoolingDriver.connect(PoolingDriver.java:175)
	at java.sql.DriverManager.getConnection(DriverManager.java:582)
	at java.sql.DriverManager.getConnection(DriverManager.java:207)
	at org.apache.commons.dbcp.TestJOCLed.getConnection(TestJOCLed.java:43)
	at org.apache.commons.dbcp.TestConnectionPool.newConnection(TestConnectionPool.java:84)
	at org.apache.commons.dbcp.TestConnectionPool.testClosing(TestConnectionPool.java:486)
	at sun.reflect.NativeMethodAccessorImpl.invoke0(Native Method)
	at sun.reflect.NativeMethodAccessorImpl.invoke(NativeMethodAccessorImpl.java:39)
	at sun.reflect.DelegatingMethodAccessorImpl.invoke(DelegatingMethodAccessorImpl.java:25)
	at java.lang.reflect.Method.invoke(Method.java:597)
	at junit.framework.TestCase.runTest(TestCase.java:164)
	at junit.framework.TestCase.runBare(TestCase.java:130)
	at junit.framework.TestResult$1.protect(TestResult.java:106)
	at junit.framework.TestResult.runProtected(TestResult.java:124)
	at junit.framework.TestResult.run(TestResult.java:109)
	at junit.framework.TestCase.run(TestCase.java:120)
	at junit.framework.TestSuite.runTest(TestSuite.java:230)
	at junit.framework.TestSuite.run(TestSuite.java:225)
	at sun.reflect.GeneratedMethodAccessor2.invoke(Unknown Source)
	at sun.reflect.DelegatingMethodAccessorImpl.invoke(DelegatingMethodAccessorImpl.java:25)
	at java.lang.reflect.Method.invoke(Method.java:597)
	at org.apache.maven.surefire.junit.JUnitTestSet.execute(JUnitTestSet.java:213)
	at org.apache.maven.surefire.suite.AbstractDirectoryTestSuite.executeTestSet(AbstractDirectoryTestSuite.java:140)
	at org.apache.maven.surefire.suite.AbstractDirectoryTestSuite.execute(AbstractDirectoryTestSuite.java:127)
	at org.apache.maven.surefire.Surefire.run(Surefire.java:177)
	at sun.reflect.NativeMethodAccessorImpl.invoke0(Native Method)
	at sun.reflect.NativeMethodAccessorImpl.invoke(NativeMethodAccessorImpl.java:39)
	at sun.reflect.DelegatingMethodAccessorImpl.invoke(DelegatingMethodAccessorImpl.java:25)
	at java.lang.reflect.Method.invoke(Method.java:597)
	at org.apache.maven.surefire.booter.SurefireBooter.runSuitesInProcess(SurefireBooter.java:345)
	at org.apache.maven.surefire.booter.SurefireBooter.main(SurefireBooter.java:1009)
Caused by: java.lang.ClassNotFoundException: org.apache.xerces.parsers.SAXParser
	at org.xml.sax.helpers.XMLReaderFactory.loadClass(XMLReaderFactory.java:189)
	at org.xml.sax.helpers.XMLReaderFactory.createXMLReader(XMLReaderFactory.java:150)
	at org.apache.commons.jocl.JOCLContentHandler.parse(JOCLContentHandler.java:339)
	at org.apache.commons.jocl.JOCLContentHandler.parse(JOCLContentHandler.java:271)
	at org.apache.commons.dbcp.PoolingDriver.getConnectionPool(PoolingDriver.java:116)
	... 31 more
Caused by: java.lang.ClassNotFoundException: org.apache.xerces.parsers.SAXParser
	at org.xml.sax.helpers.XMLReaderFactory.loadClass(XMLReaderFactory.java:189)
	at org.xml.sax.helpers.XMLReaderFactory.createXMLReader(XMLReaderFactory.java:150)
	at org.apache.commons.jocl.JOCLContentHandler.parse(JOCLContentHandler.java:339)
	at org.apache.commons.jocl.JOCLContentHandler.parse(JOCLContentHandler.java:271)
	at org.apache.commons.dbcp.PoolingDriver.getConnectionPool(PoolingDriver.java:116)
	... 31 more

    testMaxActive :
  java.sql.SQLException
  java.sql.SQLException: Could not parse configuration file
	at org.apache.commons.dbcp.PoolingDriver.getConnectionPool(PoolingDriver.java:119)
	at org.apache.commons.dbcp.PoolingDriver.connect(PoolingDriver.java:175)
	at java.sql.DriverManager.getConnection(DriverManager.java:582)
	at java.sql.DriverManager.getConnection(DriverManager.java:207)
	at org.apache.commons.dbcp.TestJOCLed.getConnection(TestJOCLed.java:43)
	at org.apache.commons.dbcp.TestConnectionPool.newConnection(TestConnectionPool.java:84)
	at org.apache.commons.dbcp.TestConnectionPool.testMaxActive(TestConnectionPool.java:504)
	at sun.reflect.NativeMethodAccessorImpl.invoke0(Native Method)
	at sun.reflect.NativeMethodAccessorImpl.invoke(NativeMethodAccessorImpl.java:39)
	at sun.reflect.DelegatingMethodAccessorImpl.invoke(DelegatingMethodAccessorImpl.java:25)
	at java.lang.reflect.Method.invoke(Method.java:597)
	at junit.framework.TestCase.runTest(TestCase.java:164)
	at junit.framework.TestCase.runBare(TestCase.java:130)
	at junit.framework.TestResult$1.protect(TestResult.java:106)
	at junit.framework.TestResult.runProtected(TestResult.java:124)
	at junit.framework.TestResult.run(TestResult.java:109)
	at junit.framework.TestCase.run(TestCase.java:120)
	at junit.framework.TestSuite.runTest(TestSuite.java:230)
	at junit.framework.TestSuite.run(TestSuite.java:225)
	at sun.reflect.GeneratedMethodAccessor2.invoke(Unknown Source)
	at sun.reflect.DelegatingMethodAccessorImpl.invoke(DelegatingMethodAccessorImpl.java:25)
	at java.lang.reflect.Method.invoke(Method.java:597)
	at org.apache.maven.surefire.junit.JUnitTestSet.execute(JUnitTestSet.java:213)
	at org.apache.maven.surefire.suite.AbstractDirectoryTestSuite.executeTestSet(AbstractDirectoryTestSuite.java:140)
	at org.apache.maven.surefire.suite.AbstractDirectoryTestSuite.execute(AbstractDirectoryTestSuite.java:127)
	at org.apache.maven.surefire.Surefire.run(Surefire.java:177)
	at sun.reflect.NativeMethodAccessorImpl.invoke0(Native Method)
	at sun.reflect.NativeMethodAccessorImpl.invoke(NativeMethodAccessorImpl.java:39)
	at sun.reflect.DelegatingMethodAccessorImpl.invoke(DelegatingMethodAccessorImpl.java:25)
	at java.lang.reflect.Method.invoke(Method.java:597)
	at org.apache.maven.surefire.booter.SurefireBooter.runSuitesInProcess(SurefireBooter.java:345)
	at org.apache.maven.surefire.booter.SurefireBooter.main(SurefireBooter.java:1009)
Caused by: java.lang.ClassNotFoundException: org.apache.xerces.parsers.SAXParser
	at org.xml.sax.helpers.XMLReaderFactory.loadClass(XMLReaderFactory.java:189)
	at org.xml.sax.helpers.XMLReaderFactory.createXMLReader(XMLReaderFactory.java:150)
	at org.apache.commons.jocl.JOCLContentHandler.parse(JOCLContentHandler.java:339)
	at org.apache.commons.jocl.JOCLContentHandler.parse(JOCLContentHandler.java:271)
	at org.apache.commons.dbcp.PoolingDriver.getConnectionPool(PoolingDriver.java:116)
	... 31 more
Caused by: java.lang.ClassNotFoundException: org.apache.xerces.parsers.SAXParser
	at org.xml.sax.helpers.XMLReaderFactory.loadClass(XMLReaderFactory.java:189)
	at org.xml.sax.helpers.XMLReaderFactory.createXMLReader(XMLReaderFactory.java:150)
	at org.apache.commons.jocl.JOCLContentHandler.parse(JOCLContentHandler.java:339)
	at org.apache.commons.jocl.JOCLContentHandler.parse(JOCLContentHandler.java:271)
	at org.apache.commons.dbcp.PoolingDriver.getConnectionPool(PoolingDriver.java:116)
	... 31 more


    testHashing :
  java.sql.SQLException
  java.sql.SQLException: Could not parse configuration file
	at org.apache.commons.dbcp.PoolingDriver.getConnectionPool(PoolingDriver.java:119)
	at org.apache.commons.dbcp.PoolingDriver.connect(PoolingDriver.java:175)
	at java.sql.DriverManager.getConnection(DriverManager.java:582)
	at java.sql.DriverManager.getConnection(DriverManager.java:207)
	at org.apache.commons.dbcp.TestJOCLed.getConnection(TestJOCLed.java:43)
	at org.apache.commons.dbcp.TestConnectionPool.testHashing(TestConnectionPool.java:526)
	at sun.reflect.NativeMethodAccessorImpl.invoke0(Native Method)
	at sun.reflect.NativeMethodAccessorImpl.invoke(NativeMethodAccessorImpl.java:39)
	at sun.reflect.DelegatingMethodAccessorImpl.invoke(DelegatingMethodAccessorImpl.java:25)
	at java.lang.reflect.Method.invoke(Method.java:597)
	at junit.framework.TestCase.runTest(TestCase.java:164)
	at junit.framework.TestCase.runBare(TestCase.java:130)
	at junit.framework.TestResult$1.protect(TestResult.java:106)
	at junit.framework.TestResult.runProtected(TestResult.java:124)
	at junit.framework.TestResult.run(TestResult.java:109)
	at junit.framework.TestCase.run(TestCase.java:120)
	at junit.framework.TestSuite.runTest(TestSuite.java:230)
	at junit.framework.TestSuite.run(TestSuite.java:225)
	at sun.reflect.GeneratedMethodAccessor2.invoke(Unknown Source)
	at sun.reflect.DelegatingMethodAccessorImpl.invoke(DelegatingMethodAccessorImpl.java:25)
	at java.lang.reflect.Method.invoke(Method.java:597)
	at org.apache.maven.surefire.junit.JUnitTestSet.execute(JUnitTestSet.java:213)
	at org.apache.maven.surefire.suite.AbstractDirectoryTestSuite.executeTestSet(AbstractDirectoryTestSuite.java:140)
	at org.apache.maven.surefire.suite.AbstractDirectoryTestSuite.execute(AbstractDirectoryTestSuite.java:127)
	at org.apache.maven.surefire.Surefire.run(Surefire.java:177)
	at sun.reflect.NativeMethodAccessorImpl.invoke0(Native Method)
	at sun.reflect.NativeMethodAccessorImpl.invoke(NativeMethodAccessorImpl.java:39)
	at sun.reflect.DelegatingMethodAccessorImpl.invoke(DelegatingMethodAccessorImpl.java:25)
	at java.lang.reflect.Method.invoke(Method.java:597)
	at org.apache.maven.surefire.booter.SurefireBooter.runSuitesInProcess(SurefireBooter.java:345)
	at org.apache.maven.surefire.booter.SurefireBooter.main(SurefireBooter.java:1009)
Caused by: java.lang.ClassNotFoundException: org.apache.xerces.parsers.SAXParser
	at org.xml.sax.helpers.XMLReaderFactory.loadClass(XMLReaderFactory.java:189)
	at org.xml.sax.helpers.XMLReaderFactory.createXMLReader(XMLReaderFactory.java:150)
	at org.apache.commons.jocl.JOCLContentHandler.parse(JOCLContentHandler.java:339)
	at org.apache.commons.jocl.JOCLContentHandler.parse(JOCLContentHandler.java:271)
	at org.apache.commons.dbcp.PoolingDriver.getConnectionPool(PoolingDriver.java:116)
	... 30 more
Caused by: java.lang.ClassNotFoundException: org.apache.xerces.parsers.SAXParser
	at org.xml.sax.helpers.XMLReaderFactory.loadClass(XMLReaderFactory.java:189)
	at org.xml.sax.helpers.XMLReaderFactory.createXMLReader(XMLReaderFactory.java:150)
	at org.apache.commons.jocl.JOCLContentHandler.parse(JOCLContentHandler.java:339)
	at org.apache.commons.jocl.JOCLContentHandler.parse(JOCLContentHandler.java:271)
	at org.apache.commons.dbcp.PoolingDriver.getConnectionPool(PoolingDriver.java:116)
	... 30 more


    testThreaded :
  junit.framework.AssertionFailedError
  junit.framework.AssertionFailedError
	at junit.framework.Assert.fail(Assert.java:47)
	at junit.framework.Assert.fail(Assert.java:53)
	at org.apache.commons.dbcp.TestConnectionPool.testThreaded(TestConnectionPool.java:552)
	at sun.reflect.NativeMethodAccessorImpl.invoke0(Native Method)
	at sun.reflect.NativeMethodAccessorImpl.invoke(NativeMethodAccessorImpl.java:39)
	at sun.reflect.DelegatingMethodAccessorImpl.invoke(DelegatingMethodAccessorImpl.java:25)
	at java.lang.reflect.Method.invoke(Method.java:597)
	at junit.framework.TestCase.runTest(TestCase.java:164)
	at junit.framework.TestCase.runBare(TestCase.java:130)
	at junit.framework.TestResult$1.protect(TestResult.java:106)
	at junit.framework.TestResult.runProtected(TestResult.java:124)
	at junit.framework.TestResult.run(TestResult.java:109)
	at junit.framework.TestCase.run(TestCase.java:120)
	at junit.framework.TestSuite.runTest(TestSuite.java:230)
	at junit.framework.TestSuite.run(TestSuite.java:225)
	at sun.reflect.GeneratedMethodAccessor2.invoke(Unknown Source)
	at sun.reflect.DelegatingMethodAccessorImpl.invoke(DelegatingMethodAccessorImpl.java:25)
	at java.lang.reflect.Method.invoke(Method.java:597)
	at org.apache.maven.surefire.junit.JUnitTestSet.execute(JUnitTestSet.java:213)
	at org.apache.maven.surefire.suite.AbstractDirectoryTestSuite.executeTestSet(AbstractDirectoryTestSuite.java:140)
	at org.apache.maven.surefire.suite.AbstractDirectoryTestSuite.execute(AbstractDirectoryTestSuite.java:127)
	at org.apache.maven.surefire.Surefire.run(Surefire.java:177)
	at sun.reflect.NativeMethodAccessorImpl.invoke0(Native Method)
	at sun.reflect.NativeMethodAccessorImpl.invoke(NativeMethodAccessorImpl.java:39)
	at sun.reflect.DelegatingMethodAccessorImpl.invoke(DelegatingMethodAccessorImpl.java:25)
	at java.lang.reflect.Method.invoke(Method.java:597)
	at org.apache.maven.surefire.booter.SurefireBooter.runSuitesInProcess(SurefireBooter.java:345)
	at org.apache.maven.surefire.booter.SurefireBooter.main(SurefireBooter.java:1009)


    testPrepareStatementOptions :
  java.sql.SQLException
  java.sql.SQLException: Could not parse configuration file
	at org.apache.commons.dbcp.PoolingDriver.getConnectionPool(PoolingDriver.java:119)
	at org.apache.commons.dbcp.PoolingDriver.connect(PoolingDriver.java:175)
	at java.sql.DriverManager.getConnection(DriverManager.java:582)
	at java.sql.DriverManager.getConnection(DriverManager.java:207)
	at org.apache.commons.dbcp.TestJOCLed.getConnection(TestJOCLed.java:43)
	at org.apache.commons.dbcp.TestConnectionPool.newConnection(TestConnectionPool.java:84)
	at org.apache.commons.dbcp.TestConnectionPool.testPrepareStatementOptions(TestConnectionPool.java:623)
	at sun.reflect.NativeMethodAccessorImpl.invoke0(Native Method)
	at sun.reflect.NativeMethodAccessorImpl.invoke(NativeMethodAccessorImpl.java:39)
	at sun.reflect.DelegatingMethodAccessorImpl.invoke(DelegatingMethodAccessorImpl.java:25)
	at java.lang.reflect.Method.invoke(Method.java:597)
	at junit.framework.TestCase.runTest(TestCase.java:164)
	at junit.framework.TestCase.runBare(TestCase.java:130)
	at junit.framework.TestResult$1.protect(TestResult.java:106)
	at junit.framework.TestResult.runProtected(TestResult.java:124)
	at junit.framework.TestResult.run(TestResult.java:109)
	at junit.framework.TestCase.run(TestCase.java:120)
	at junit.framework.TestSuite.runTest(TestSuite.java:230)
	at junit.framework.TestSuite.run(TestSuite.java:225)
	at sun.reflect.GeneratedMethodAccessor2.invoke(Unknown Source)
	at sun.reflect.DelegatingMethodAccessorImpl.invoke(DelegatingMethodAccessorImpl.java:25)
	at java.lang.reflect.Method.invoke(Method.java:597)
	at org.apache.maven.surefire.junit.JUnitTestSet.execute(JUnitTestSet.java:213)
	at org.apache.maven.surefire.suite.AbstractDirectoryTestSuite.executeTestSet(AbstractDirectoryTestSuite.java:140)
	at org.apache.maven.surefire.suite.AbstractDirectoryTestSuite.execute(AbstractDirectoryTestSuite.java:127)
	at org.apache.maven.surefire.Surefire.run(Surefire.java:177)
	at sun.reflect.NativeMethodAccessorImpl.invoke0(Native Method)
	at sun.reflect.NativeMethodAccessorImpl.invoke(NativeMethodAccessorImpl.java:39)
	at sun.reflect.DelegatingMethodAccessorImpl.invoke(DelegatingMethodAccessorImpl.java:25)
	at java.lang.reflect.Method.invoke(Method.java:597)
	at org.apache.maven.surefire.booter.SurefireBooter.runSuitesInProcess(SurefireBooter.java:345)
	at org.apache.maven.surefire.booter.SurefireBooter.main(SurefireBooter.java:1009)
Caused by: java.lang.ClassNotFoundException: org.apache.xerces.parsers.SAXParser
	at org.xml.sax.helpers.XMLReaderFactory.loadClass(XMLReaderFactory.java:189)
	at org.xml.sax.helpers.XMLReaderFactory.createXMLReader(XMLReaderFactory.java:150)
	at org.apache.commons.jocl.JOCLContentHandler.parse(JOCLContentHandler.java:339)
	at org.apache.commons.jocl.JOCLContentHandler.parse(JOCLContentHandler.java:271)
	at org.apache.commons.dbcp.PoolingDriver.getConnectionPool(PoolingDriver.java:116)
	... 31 more
Caused by: java.lang.ClassNotFoundException: org.apache.xerces.parsers.SAXParser
	at org.xml.sax.helpers.XMLReaderFactory.loadClass(XMLReaderFactory.java:189)
	at org.xml.sax.helpers.XMLReaderFactory.createXMLReader(XMLReaderFactory.java:150)
	at org.apache.commons.jocl.JOCLContentHandler.parse(JOCLContentHandler.java:339)
	at org.apache.commons.jocl.JOCLContentHandler.parse(JOCLContentHandler.java:271)
	at org.apache.commons.dbcp.PoolingDriver.getConnectionPool(PoolingDriver.java:116)
	... 31 more


    testNoRsetClose :
  java.sql.SQLException
  java.sql.SQLException: Could not parse configuration file
	at org.apache.commons.dbcp.PoolingDriver.getConnectionPool(PoolingDriver.java:119)
	at org.apache.commons.dbcp.PoolingDriver.connect(PoolingDriver.java:175)
	at java.sql.DriverManager.getConnection(DriverManager.java:582)
	at java.sql.DriverManager.getConnection(DriverManager.java:207)
	at org.apache.commons.dbcp.TestJOCLed.getConnection(TestJOCLed.java:43)
	at org.apache.commons.dbcp.TestConnectionPool.newConnection(TestConnectionPool.java:84)
	at org.apache.commons.dbcp.TestConnectionPool.testNoRsetClose(TestConnectionPool.java:643)
	at sun.reflect.NativeMethodAccessorImpl.invoke0(Native Method)
	at sun.reflect.NativeMethodAccessorImpl.invoke(NativeMethodAccessorImpl.java:39)
	at sun.reflect.DelegatingMethodAccessorImpl.invoke(DelegatingMethodAccessorImpl.java:25)
	at java.lang.reflect.Method.invoke(Method.java:597)
	at junit.framework.TestCase.runTest(TestCase.java:164)
	at junit.framework.TestCase.runBare(TestCase.java:130)
	at junit.framework.TestResult$1.protect(TestResult.java:106)
	at junit.framework.TestResult.runProtected(TestResult.java:124)
	at junit.framework.TestResult.run(TestResult.java:109)
	at junit.framework.TestCase.run(TestCase.java:120)
	at junit.framework.TestSuite.runTest(TestSuite.java:230)
	at junit.framework.TestSuite.run(TestSuite.java:225)
	at sun.reflect.GeneratedMethodAccessor2.invoke(Unknown Source)
	at sun.reflect.DelegatingMethodAccessorImpl.invoke(DelegatingMethodAccessorImpl.java:25)
	at java.lang.reflect.Method.invoke(Method.java:597)
	at org.apache.maven.surefire.junit.JUnitTestSet.execute(JUnitTestSet.java:213)
	at org.apache.maven.surefire.suite.AbstractDirectoryTestSuite.executeTestSet(AbstractDirectoryTestSuite.java:140)
	at org.apache.maven.surefire.suite.AbstractDirectoryTestSuite.execute(AbstractDirectoryTestSuite.java:127)
	at org.apache.maven.surefire.Surefire.run(Surefire.java:177)
	at sun.reflect.NativeMethodAccessorImpl.invoke0(Native Method)
	at sun.reflect.NativeMethodAccessorImpl.invoke(NativeMethodAccessorImpl.java:39)
	at sun.reflect.DelegatingMethodAccessorImpl.invoke(DelegatingMethodAccessorImpl.java:25)
	at java.lang.reflect.Method.invoke(Method.java:597)
	at org.apache.maven.surefire.booter.SurefireBooter.runSuitesInProcess(SurefireBooter.java:345)
	at org.apache.maven.surefire.booter.SurefireBooter.main(SurefireBooter.java:1009)
Caused by: java.lang.ClassNotFoundException: org.apache.xerces.parsers.SAXParser
	at org.xml.sax.helpers.XMLReaderFactory.loadClass(XMLReaderFactory.java:189)
	at org.xml.sax.helpers.XMLReaderFactory.createXMLReader(XMLReaderFactory.java:150)
	at org.apache.commons.jocl.JOCLContentHandler.parse(JOCLContentHandler.java:339)
	at org.apache.commons.jocl.JOCLContentHandler.parse(JOCLContentHandler.java:271)
	at org.apache.commons.dbcp.PoolingDriver.getConnectionPool(PoolingDriver.java:116)
	... 31 more
Caused by: java.lang.ClassNotFoundException: org.apache.xerces.parsers.SAXParser
	at org.xml.sax.helpers.XMLReaderFactory.loadClass(XMLReaderFactory.java:189)
	at org.xml.sax.helpers.XMLReaderFactory.createXMLReader(XMLReaderFactory.java:150)
	at org.apache.commons.jocl.JOCLContentHandler.parse(JOCLContentHandler.java:339)
	at org.apache.commons.jocl.JOCLContentHandler.parse(JOCLContentHandler.java:271)
	at org.apache.commons.dbcp.PoolingDriver.getConnectionPool(PoolingDriver.java:116)
	... 31 more


    testHashCode :
  java.sql.SQLException
  java.sql.SQLException: Could not parse configuration file
	at org.apache.commons.dbcp.PoolingDriver.getConnectionPool(PoolingDriver.java:119)
	at org.apache.commons.dbcp.PoolingDriver.connect(PoolingDriver.java:175)
	at java.sql.DriverManager.getConnection(DriverManager.java:582)
	at java.sql.DriverManager.getConnection(DriverManager.java:207)
	at org.apache.commons.dbcp.TestJOCLed.getConnection(TestJOCLed.java:43)
	at org.apache.commons.dbcp.TestConnectionPool.newConnection(TestConnectionPool.java:84)
	at org.apache.commons.dbcp.TestConnectionPool.testHashCode(TestConnectionPool.java:656)
	at sun.reflect.NativeMethodAccessorImpl.invoke0(Native Method)
	at sun.reflect.NativeMethodAccessorImpl.invoke(NativeMethodAccessorImpl.java:39)
	at sun.reflect.DelegatingMethodAccessorImpl.invoke(DelegatingMethodAccessorImpl.java:25)
	at java.lang.reflect.Method.invoke(Method.java:597)
	at junit.framework.TestCase.runTest(TestCase.java:164)
	at junit.framework.TestCase.runBare(TestCase.java:130)
	at junit.framework.TestResult$1.protect(TestResult.java:106)
	at junit.framework.TestResult.runProtected(TestResult.java:124)
	at junit.framework.TestResult.run(TestResult.java:109)
	at junit.framework.TestCase.run(TestCase.java:120)
	at junit.framework.TestSuite.runTest(TestSuite.java:230)
	at junit.framework.TestSuite.run(TestSuite.java:225)
	at sun.reflect.GeneratedMethodAccessor2.invoke(Unknown Source)
	at sun.reflect.DelegatingMethodAccessorImpl.invoke(DelegatingMethodAccessorImpl.java:25)
	at java.lang.reflect.Method.invoke(Method.java:597)
	at org.apache.maven.surefire.junit.JUnitTestSet.execute(JUnitTestSet.java:213)
	at org.apache.maven.surefire.suite.AbstractDirectoryTestSuite.executeTestSet(AbstractDirectoryTestSuite.java:140)
	at org.apache.maven.surefire.suite.AbstractDirectoryTestSuite.execute(AbstractDirectoryTestSuite.java:127)
	at org.apache.maven.surefire.Surefire.run(Surefire.java:177)
	at sun.reflect.NativeMethodAccessorImpl.invoke0(Native Method)
	at sun.reflect.NativeMethodAccessorImpl.invoke(NativeMethodAccessorImpl.java:39)
	at sun.reflect.DelegatingMethodAccessorImpl.invoke(DelegatingMethodAccessorImpl.java:25)
	at java.lang.reflect.Method.invoke(Method.java:597)
	at org.apache.maven.surefire.booter.SurefireBooter.runSuitesInProcess(SurefireBooter.java:345)
	at org.apache.maven.surefire.booter.SurefireBooter.main(SurefireBooter.java:1009)
Caused by: java.lang.ClassNotFoundException: org.apache.xerces.parsers.SAXParser
	at org.xml.sax.helpers.XMLReaderFactory.loadClass(XMLReaderFactory.java:189)
	at org.xml.sax.helpers.XMLReaderFactory.createXMLReader(XMLReaderFactory.java:150)
	at org.apache.commons.jocl.JOCLContentHandler.parse(JOCLContentHandler.java:339)
	at org.apache.commons.jocl.JOCLContentHandler.parse(JOCLContentHandler.java:271)
	at org.apache.commons.dbcp.PoolingDriver.getConnectionPool(PoolingDriver.java:116)
	... 31 more
Caused by: java.lang.ClassNotFoundException: org.apache.xerces.parsers.SAXParser
	at org.xml.sax.helpers.XMLReaderFactory.loadClass(XMLReaderFactory.java:189)
	at org.xml.sax.helpers.XMLReaderFactory.createXMLReader(XMLReaderFactory.java:150)
	at org.apache.commons.jocl.JOCLContentHandler.parse(JOCLContentHandler.java:339)
	at org.apache.commons.jocl.JOCLContentHandler.parse(JOCLContentHandler.java:271)
	at org.apache.commons.dbcp.PoolingDriver.getConnectionPool(PoolingDriver.java:116)
	... 31 more


  



---------------------------------------------------------------------
To unsubscribe, e-mail: dev-unsubscribe@commons.apache.org
For additional commands, e-mail: dev-help@commons.apache.org


Mime
View raw message