commons-dev mailing list archives

Site index · List index
Message view « Date » · « Thread »
Top « Date » · « Thread »
From Gump <iss...@commons.apache.org>
Subject [GUMP@vmgump]: Project commons-vfs-test (in module apache-commons) failed
Date Tue, 27 Oct 2009 02:43:42 GMT
To whom it may engage...
        
This is an automated request, but not an unsolicited one. For 
more information please visit http://gump.apache.org/nagged.html, 
and/or contact the folk at general@gump.apache.org.

Project commons-vfs-test has an issue affecting its community integration.
This issue affects 1 projects,
 and has been outstanding for 124 runs.
The current state of this project is 'Failed', with reason 'Build Failed'.
For reference only, the following projects are affected by this:
    - commons-vfs-test :  Apache Commons


Full details are available at:
    http://vmgump.apache.org/gump/public/apache-commons/commons-vfs-test/index.html

That said, some information snippets are provided here.

The following annotations (debug/informational/warning/error messages) were provided:
 -WARNING- Overriding Maven2 settings: [/srv/gump/public/workspace/apache-commons/vfs/gump_mvn_settings.xml]
 -DEBUG- (Gump generated) Maven2 Settings in: /srv/gump/public/workspace/apache-commons/vfs/gump_mvn_settings.xml
 -INFO- Failed with reason build failed
 -DEBUG- Maven POM in: /srv/gump/public/workspace/apache-commons/vfs/pom.xml
 -INFO- Project Reports in: /srv/gump/public/workspace/apache-commons/vfs/core/target/surefire-reports



The following work was performed:
http://vmgump.apache.org/gump/public/apache-commons/commons-vfs-test/gump_work/build_apache-commons_commons-vfs-test.html
Work Name: build_apache-commons_commons-vfs-test (Type: Build)
Work ended in a state of : Failed
Elapsed: 1 min 57 secs
Command Line: mvn --batch-mode --settings /srv/gump/public/workspace/apache-commons/vfs/gump_mvn_settings.xml
package 
[Working Directory: /srv/gump/public/workspace/apache-commons/vfs]
CLASSPATH: /usr/lib/jvm/java-6-sun/lib/tools.jar:/srv/gump/public/workspace/apache-commons/vfs/core/target/commons-vfs-2.0-SNAPSHOT.jar
---------------------------------------------
Tests run: 56, Failures: 0, Errors: 2, Skipped: 0, Time elapsed: 4.651 sec <<< FAILURE!

Results :

Tests in error: 
  testLoadClass(org.apache.commons.vfs.impl.test.VfsClassLoaderTests)
  testSealing(org.apache.commons.vfs.impl.test.VfsClassLoaderTests)
  testLoadClass(org.apache.commons.vfs.impl.test.VfsClassLoaderTests)
  testSealing(org.apache.commons.vfs.impl.test.VfsClassLoaderTests)
  testLoadClass(org.apache.commons.vfs.impl.test.VfsClassLoaderTests)
  testSealing(org.apache.commons.vfs.impl.test.VfsClassLoaderTests)
  testLoadClass(org.apache.commons.vfs.impl.test.VfsClassLoaderTests)
  testSealing(org.apache.commons.vfs.impl.test.VfsClassLoaderTests)
  testLoadClass(org.apache.commons.vfs.impl.test.VfsClassLoaderTests)
  testSealing(org.apache.commons.vfs.impl.test.VfsClassLoaderTests)
  testLoadClass(org.apache.commons.vfs.impl.test.VfsClassLoaderTests)
  testSealing(org.apache.commons.vfs.impl.test.VfsClassLoaderTests)
  testLoadClass(org.apache.commons.vfs.impl.test.VfsClassLoaderTests)
  testSealing(org.apache.commons.vfs.impl.test.VfsClassLoaderTests)
  testLoadClass(org.apache.commons.vfs.impl.test.VfsClassLoaderTests)
  testSealing(org.apache.commons.vfs.impl.test.VfsClassLoaderTests)
  testLoadClass(org.apache.commons.vfs.impl.test.VfsClassLoaderTests)
  testSealing(org.apache.commons.vfs.impl.test.VfsClassLoaderTests)
  testLoadClass(org.apache.commons.vfs.impl.test.VfsClassLoaderTests)
  testSealing(org.apache.commons.vfs.impl.test.VfsClassLoaderTests)
  testLoadClass(org.apache.commons.vfs.impl.test.VfsClassLoaderTests)
  testSealing(org.apache.commons.vfs.impl.test.VfsClassLoaderTests)
  testParseUri(org.apache.commons.vfs.provider.test.GenericFileNameTestCase)
  testLoadClass(org.apache.commons.vfs.impl.test.VfsClassLoaderTests)
  testSealing(org.apache.commons.vfs.impl.test.VfsClassLoaderTests)
  testLoadClass(org.apache.commons.vfs.impl.test.VfsClassLoaderTests)
  testSealing(org.apache.commons.vfs.impl.test.VfsClassLoaderTests)
  testLoadClass(org.apache.commons.vfs.impl.test.VfsClassLoaderTests)
  testSealing(org.apache.commons.vfs.impl.test.VfsClassLoaderTests)

Tests run: 974, Failures: 0, Errors: 29, Skipped: 0

[INFO] ------------------------------------------------------------------------
[ERROR] BUILD FAILURE
[INFO] ------------------------------------------------------------------------
[INFO] There are test failures.

Please refer to /srv/gump/public/workspace/apache-commons/vfs/core/target/surefire-reports
for the individual test results.
[INFO] ------------------------------------------------------------------------
[INFO] For more information, run Maven with the -e switch
[INFO] ------------------------------------------------------------------------
[INFO] Total time: 1 minute 56 seconds
[INFO] Finished at: Tue Oct 27 01:43:39 PST 2009
[INFO] Final Memory: 23M/41M
[INFO] ------------------------------------------------------------------------
---------------------------------------------

To subscribe to this information via syndicated feeds:
- RSS: http://vmgump.apache.org/gump/public/apache-commons/commons-vfs-test/rss.xml
- Atom: http://vmgump.apache.org/gump/public/apache-commons/commons-vfs-test/atom.xml

============================== Gump Tracking Only ===
Produced by Gump version 2.3.
Gump Run 07000027102009, vmgump:vmgump-public:07000027102009
Gump E-mail Identifier (unique within run) #31.

--
Apache Gump
http://gump.apache.org/ [Instance: vmgump]

---------------------------------------------------------------------
To unsubscribe, e-mail: dev-unsubscribe@commons.apache.org
For additional commands, e-mail: dev-help@commons.apache.org


Mime
View raw message