commons-dev mailing list archives

Site index · List index
Message view « Date » · « Thread »
Top « Date » · « Thread »
From commons-jelly development <...@commons.apache.org>
Subject [GUMP@vmgump]: Project commons-jelly-test (in module commons-jelly) failed
Date Mon, 14 Sep 2009 07:35:49 GMT
To whom it may engage...
        
This is an automated request, but not an unsolicited one. For 
more information please visit http://gump.apache.org/nagged.html, 
and/or contact the folk at general@gump.apache.org.

Project commons-jelly-test has an issue affecting its community integration.
This issue affects 1 projects,
 and has been outstanding for 5 runs.
The current state of this project is 'Failed', with reason 'Build Failed'.
For reference only, the following projects are affected by this:
    - commons-jelly-test :  Commons Jelly


Full details are available at:
    http://vmgump.apache.org/gump/public/commons-jelly/commons-jelly-test/index.html

That said, some information snippets are provided here.

The following annotations (debug/informational/warning/error messages) were provided:
 -DEBUG- Dependency on jakarta-servletapi-5-servlet exists, no need to add for property maven.jar.servletapi.
 -DEBUG- Dependency on jakarta-taglibs-standard exists, no need to add for property maven.jar.jstl.
 -DEBUG- Dependency on xml-xerces exists, no need to add for property maven.jar.xerces.
 -WARNING- Overriding Maven properties: [/srv/gump/public/workspace/commons-jelly/build.properties]
 -DEBUG- (Gump generated) Maven Properties in: /srv/gump/public/workspace/commons-jelly/build.properties
 -INFO- Failed with reason build failed
 -DEBUG- Maven POM in: /srv/gump/public/workspace/commons-jelly/project.xml
 -DEBUG- Maven project properties in: /srv/gump/public/workspace/commons-jelly/project.properties
 -INFO- Project Reports in: /srv/gump/public/workspace/commons-jelly/target/test-reports



The following work was performed:
http://vmgump.apache.org/gump/public/commons-jelly/commons-jelly-test/gump_work/build_commons-jelly_commons-jelly-test.html
Work Name: build_commons-jelly_commons-jelly-test (Type: Build)
Work ended in a state of : Failed
Elapsed: 48 secs
Command Line: maven --offline jar 
[Working Directory: /srv/gump/public/workspace/commons-jelly]
CLASSPATH: /usr/lib/jvm/java-6-sun/lib/tools.jar:/srv/gump/public/workspace/apache-commons/beanutils/dist/commons-beanutils-14092009.jar:/srv/gump/public/workspace/apache-commons/cli/target/commons-cli-14092009.jar:/srv/gump/public/workspace/apache-commons/collections/build/commons-collections-14092009.jar:/srv/gump/public/workspace/apache-commons/discovery/dist/commons-discovery.jar:/srv/gump/public/workspace/apache-commons/jexl/target/commons-jexl-2.0-SNAPSHOT.jar:/srv/gump/public/workspace/apache-commons/lang/target/commons-lang-3.0-SNAPSHOT.jar:/srv/gump/public/workspace/apache-commons/logging/target/commons-logging-14092009.jar:/srv/gump/public/workspace/apache-commons/logging/target/commons-logging-api-14092009.jar:/srv/gump/public/workspace/dom4j/build/dom4j.jar:/srv/gump/packages/forehead/forehead-1.0-beta-5.jar:/srv/gump/public/workspace/jakarta-servletapi-5/jsr154/dist/lib/servlet-api.jar:/srv/gump/public/workspace/jakarta-taglibs/standard/spec/target/taglibs-standa
 rd-spec-1.2-SNAPSHOT.jar:/srv/gump/public/workspace/jaxen/target/jaxen-14092009.jar:/srv/gump/public/workspace/junit/dist/junit-14092009.jar:/srv/gump/public/workspace/xml-commons/java/external/build/xml-apis-ext.jar
---------------------------------------------
    [junit] WARNING: org.apache.commons.jexl.ExpressionFactory.createExpression@69![0,9]:
'parentVar;' undefined variable parentVar
    [junit] Sep 14, 2009 7:35:39 AM org.apache.commons.jexl.Interpreter visit
    [junit] WARNING: org.apache.commons.jexl.ExpressionFactory.createExpression@69![0,5]:
'test1 == null;' undefined variable test1
    [junit] Sep 14, 2009 7:35:39 AM org.apache.commons.jexl.Interpreter visit
    [junit] WARNING: org.apache.commons.jexl.ExpressionFactory.createExpression@69![0,9]:
'parentVar;' undefined variable parentVar
    [junit] Sep 14, 2009 7:35:39 AM org.apache.commons.jexl.Interpreter visit
    [junit] WARNING: org.apache.commons.jexl.ExpressionFactory.createExpression@69![0,5]:
'test1 == null;' undefined variable test1
    [junit] ------------- ---------------- ---------------
    [junit] Testcase: testFileTag(org.apache.commons.jelly.tags.junit.CaseTag$1):	Caused an
ERROR
    [junit] file:/srv/gump/public/workspace/commons-jelly/target/test-classes/org/apache/commons/jelly/suite.jelly:360:75:
<test:assertEquals>  expected:[22] but was:[22]
    [junit] Expected expression: ${singleSize*2}
    [junit] Actual expression: ${doubleSize} File: file:/srv/gump/public/workspace/commons-jelly/target/test-classes/org/apache/commons/jelly/suite.jelly
At tag <test:assertEquals>: line: 360 column: 75
    [junit] org.apache.commons.jelly.JellyTagException: file:/srv/gump/public/workspace/commons-jelly/target/test-classes/org/apache/commons/jelly/suite.jelly:360:75:
<test:assertEquals>  expected:[22] but was:[22]
    [junit] Expected expression: ${singleSize*2}
    [junit] Actual expression: ${doubleSize} File: file:/srv/gump/public/workspace/commons-jelly/target/test-classes/org/apache/commons/jelly/suite.jelly
At tag <test:assertEquals>: line: 360 column: 75
    [junit] 	at org.apache.commons.jelly.impl.TagScript.handleException(TagScript.java:732)
    [junit] 	at org.apache.commons.jelly.impl.TagScript.run(TagScript.java:287)
    [junit] 	at org.apache.commons.jelly.impl.ScriptBlock.run(ScriptBlock.java:96)
    [junit] 	at org.apache.commons.jelly.tags.junit.CaseTag$1.runTest(CaseTag.java:60)
    [junit] Caused by: org.apache.commons.jelly.tags.junit.JellyAssertionFailedError:  expected:[22]
but was:[22]
    [junit] Expected expression: ${singleSize*2}
    [junit] Actual expression: ${doubleSize} File: file:/srv/gump/public/workspace/commons-jelly/target/test-classes/org/apache/commons/jelly/suite.jelly
At tag <test:assertEquals>: line: 360 column: 75
    [junit] 	at org.apache.commons.jelly.tags.junit.AssertTagSupport.fail(AssertTagSupport.java:40)
    [junit] 	at org.apache.commons.jelly.tags.junit.AssertTagSupport.failNotEquals(AssertTagSupport.java:63)
    [junit] 	at org.apache.commons.jelly.tags.junit.AssertEqualsTag.doTag(AssertEqualsTag.java:56)
    [junit] 	at org.apache.commons.jelly.impl.TagScript.run(TagScript.java:267)
    [junit] 	... 11 more
    [junit] Root cause
    [junit] org.apache.commons.jelly.tags.junit.JellyAssertionFailedError:  expected:[22]
but was:[22]
    [junit] Expected expression: ${singleSize*2}
    [junit] Actual expression: ${doubleSize} File: file:/srv/gump/public/workspace/commons-jelly/target/test-classes/org/apache/commons/jelly/suite.jelly
At tag <test:assertEquals>: line: 360 column: 75
    [junit] 	at org.apache.commons.jelly.tags.junit.AssertTagSupport.fail(AssertTagSupport.java:40)
    [junit] 	at org.apache.commons.jelly.tags.junit.AssertTagSupport.failNotEquals(AssertTagSupport.java:63)
    [junit] 	at org.apache.commons.jelly.tags.junit.AssertEqualsTag.doTag(AssertEqualsTag.java:56)
    [junit] 	at org.apache.commons.jelly.impl.TagScript.run(TagScript.java:267)
    [junit] 	at org.apache.commons.jelly.impl.ScriptBlock.run(ScriptBlock.java:96)
    [junit] 	at org.apache.commons.jelly.tags.junit.CaseTag$1.runTest(CaseTag.java:60)
    [junit] 
    [junit] 
    [junit] [ERROR] TEST org.apache.commons.jelly.TestJelly FAILED

BUILD FAILED
File...... /home/gump/.maven/cache/maven-test-plugin-1.6.2/plugin.jelly
Element... fail
Line...... 181
Column.... 54
There were test failures.
Total time: 47 seconds
Finished at: Mon Sep 14 07:35:39 PDT 2009

---------------------------------------------

To subscribe to this information via syndicated feeds:
- RSS: http://vmgump.apache.org/gump/public/commons-jelly/commons-jelly-test/rss.xml
- Atom: http://vmgump.apache.org/gump/public/commons-jelly/commons-jelly-test/atom.xml

============================== Gump Tracking Only ===
Produced by Gump version 2.3.
Gump Run 05000014092009, vmgump:vmgump-public:05000014092009
Gump E-mail Identifier (unique within run) #51.

--
Apache Gump
http://gump.apache.org/ [Instance: vmgump]

---------------------------------------------------------------------
To unsubscribe, e-mail: dev-unsubscribe@commons.apache.org
For additional commands, e-mail: dev-help@commons.apache.org


Mime
View raw message