commons-dev mailing list archives

Site index · List index
Message view « Date » · « Thread »
Top « Date » · « Thread »
From Continuum VMBuild Server <contin...@apache.org>
Subject [continuum] BUILD FAILURE: Commons Discovery
Date Thu, 08 May 2008 11:57:50 GMT
Online report : http://vmbuild.apache.org/continuum/buildResult.action?buildId=87926&projectId=362

Build statistics:
  State: Failed
  Previous State: Failed
  Started at: Thu 8 May 2008 04:57:29 -0700
  Finished at: Thu 8 May 2008 04:57:45 -0700
  Total time: 16s
  Build Trigger: Schedule
  Build Number: 0
  Exit code: 1
  Building machine hostname: vmbuild.apache.org
  Operating system : Linux(unknown)
  Java Home version : 
          java version "1.5.0_12"
          Java(TM) 2 Runtime Environment, Standard Edition (build 1.5.0_12-b04)
          Java HotSpot(TM) Client VM (build 1.5.0_12-b04, mixed mode, sharing)
        
  Builder version :
          Maven version: 2.0.7
          Java version: 1.5.0_12
          OS name: "linux" version: "2.6.20-16-server" arch: "i386"
    
****************************************************************************
SCM Changes:
****************************************************************************
Changed: niallp @ Thu 8 May 2008 04:43:09 -0700
Comment: Upgrade to commons-parent-10 pom
Files changed:
  /commons/proper/beanutils/trunk/pom.xml ( 654484 )
  /commons/proper/betwixt/trunk/pom.xml ( 654484 )
  /commons/proper/chain/trunk/pom.xml ( 654484 )
  /commons/proper/cli/trunk/pom.xml ( 654484 )
  /commons/proper/codec/trunk/pom.xml ( 654484 )
  /commons/proper/collections/trunk/pom.xml ( 654484 )
  /commons/proper/commons-build-plugin/trunk/pom.xml ( 654484 )
  /commons/proper/commons-sandbox-parent/trunk/pom.xml ( 654484 )
  /commons/proper/commons-skin/trunk/pom.xml ( 654484 )
  /commons/proper/configuration/trunk/pom.xml ( 654484 )
  /commons/proper/daemon/trunk/pom.xml ( 654484 )
  /commons/proper/dbcp/trunk/pom.xml ( 654484 )
  /commons/proper/dbutils/trunk/pom.xml ( 654484 )
  /commons/proper/digester/trunk/pom.xml ( 654484 )
  /commons/proper/discovery/trunk/pom.xml ( 654484 )
  /commons/proper/el/trunk/pom.xml ( 654484 )
  /commons/proper/email/trunk/pom.xml ( 654484 )
  /commons/proper/fileupload/trunk/pom.xml ( 654484 )
  /commons/proper/io/trunk/pom.xml ( 654484 )
  /commons/proper/jci/trunk/pom.xml ( 654484 )
  /commons/proper/jexl/trunk/pom.xml ( 654484 )
  /commons/proper/jxpath/trunk/pom.xml ( 654484 )
  /commons/proper/lang/trunk/pom.xml ( 654484 )
  /commons/proper/launcher/trunk/pom.xml ( 654484 )
  /commons/proper/logging/trunk/pom.xml ( 654484 )
  /commons/proper/math/trunk/pom.xml ( 654484 )
  /commons/proper/modeler/trunk/pom.xml ( 654484 )
  /commons/proper/net/trunk/pom.xml ( 654484 )
  /commons/proper/pool/trunk/pom.xml ( 654484 )
  /commons/proper/primitives/trunk/pom.xml ( 654484 )
  /commons/proper/proxy/trunk/pom.xml ( 654484 )
  /commons/proper/scxml/trunk/pom.xml ( 654484 )
  /commons/proper/transaction/trunk/pom.xml ( 654484 )
  /commons/proper/validator/trunk/pom.xml ( 654484 )
  /commons/proper/vfs/trunk/pom.xml ( 654484 )

****************************************************************************
Dependencies Changes:
****************************************************************************
No dependencies changed


****************************************************************************
Build Defintion:
****************************************************************************
POM filename: pom.xml
Goals: clean deploy   
Arguments: --batch-mode -DaltDeploymentRepository=vmbuild.repo::default::file://localhost/home/continuum/data/commons
-Pci
Build Fresh: false
Always Build: false
Default Build Definition: true
Schedule: COMMONS_SCHEDULE
Profile Name: Java 5
Description: 


****************************************************************************
Test Summary:
****************************************************************************
Tests: 11
Failures: 1
Total time: 116

****************************************************************************
Output:
****************************************************************************
[INFO] Scanning for projects...
[INFO] ----------------------------------------------------------------------------
[INFO] Building Commons Discovery
[INFO]    task-segment: [clean, deploy]
[INFO] ----------------------------------------------------------------------------
[INFO] [clean:clean]
[INFO] Deleting directory /home/continuum/data/working-directory/362/target
[INFO] Deleting directory /home/continuum/data/working-directory/362/target/classes
[INFO] Deleting directory /home/continuum/data/working-directory/362/target/test-classes
[INFO] Deleting directory /home/continuum/data/working-directory/362/target/site
[INFO] [antrun:run {execution: javadoc.resources}]
[INFO] Executing tasks
     [copy] Copying 2 files to /home/continuum/data/working-directory/362/target/apidocs/META-INF
[INFO] Executed tasks
[INFO] [resources:resources]
[INFO] Using default encoding to copy filtered resources.
[INFO] [compiler:compile]
[INFO] Compiling 40 source files to /home/continuum/data/working-directory/362/target/classes
[INFO] [bundle:manifest {execution: bundle-manifest}]
[INFO] [resources:testResources]
[INFO] Using default encoding to copy filtered resources.
[INFO] [compiler:testCompile]
[INFO] Compiling 7 source files to /home/continuum/data/working-directory/362/target/test-classes
[INFO] [surefire:test]
[INFO] Surefire report directory: /home/continuum/data/working-directory/362/target/surefire-reports

-------------------------------------------------------
 T E S T S
-------------------------------------------------------
Running org.apache.commons.discovery.test.TestAll
Tests run: 11, Failures: 1, Errors: 0, Skipped: 0, Time elapsed: 0.127 sec <<< FAILURE!

Results :

Failed tests: 
  testFindResources(org.apache.commons.discovery.test.TestAll)

Tests run: 11, Failures: 1, Errors: 0, Skipped: 0

[INFO] ------------------------------------------------------------------------
[ERROR] BUILD FAILURE
[INFO] ------------------------------------------------------------------------
[INFO] There are test failures.

Please refer to /home/continuum/data/working-directory/362/target/surefire-reports for the
individual test results.
[INFO] ------------------------------------------------------------------------
[INFO] For more information, run Maven with the -e switch
[INFO] ------------------------------------------------------------------------
[INFO] Total time: 11 seconds
[INFO] Finished at: Thu May 08 04:57:45 PDT 2008
[INFO] Final Memory: 12M/21M
[INFO] ------------------------------------------------------------------------

****************************************************************************



---------------------------------------------------------------------
To unsubscribe, e-mail: dev-unsubscribe@commons.apache.org
For additional commands, e-mail: dev-help@commons.apache.org


Mime
View raw message