commons-dev mailing list archives

Site index · List index
Message view « Date » · « Thread »
Top « Date » · « Thread »
From Continuum VMBuild Server <contin...@apache.org>
Subject [continuum] BUILD FAILURE: Commons Pipeline (Sandbox)
Date Thu, 08 May 2008 03:46:26 GMT
Online report : http://vmbuild.apache.org/continuum/buildResult.action?buildId=87774&projectId=187

Build statistics:
  State: Failed
  Previous State: Error
  Started at: Wed 7 May 2008 20:45:39 -0700
  Finished at: Wed 7 May 2008 20:46:08 -0700
  Total time: 28s
  Build Trigger: Forced
  Build Number: 8
  Exit code: 1
  Building machine hostname: vmbuild.apache.org
  Operating system : Linux(unknown)
  Java Home version : 
          java version "1.5.0_12"
          Java(TM) 2 Runtime Environment, Standard Edition (build 1.5.0_12-b04)
          Java HotSpot(TM) Client VM (build 1.5.0_12-b04, mixed mode, sharing)
        
  Builder version :
          Maven version: 2.0.7
          Java version: 1.5.0_12
          OS name: "linux" version: "2.6.20-16-server" arch: "i386"
    
****************************************************************************
SCM Changes:
****************************************************************************
No files changed

****************************************************************************
Dependencies Changes:
****************************************************************************
No dependencies changed


****************************************************************************
Build Defintion:
****************************************************************************
POM filename: pom.xml
Goals: clean install   
Arguments: --batch-mode
Build Fresh: false
Always Build: false
Default Build Definition: true
Schedule: COMMONS_SCHEDULE
Profile Name: Java 5
Description: 


****************************************************************************
Test Summary:
****************************************************************************
Tests: 34
Failures: 1
Total time: 10849

****************************************************************************
Output:
****************************************************************************
[INFO] Scanning for projects...
[INFO] ----------------------------------------------------------------------------
[INFO] Building Commons Pipeline (Sandbox)
[INFO]    task-segment: [clean, install]
[INFO] ----------------------------------------------------------------------------
[INFO] [clean:clean]
[INFO] Deleting directory /home/continuum/data/working-directory/187/target
[INFO] Deleting directory /home/continuum/data/working-directory/187/target/classes
[INFO] Deleting directory /home/continuum/data/working-directory/187/target/test-classes
[INFO] Deleting directory /home/continuum/data/working-directory/187/target/site
[INFO] [antrun:run {execution: javadoc.resources}]
[INFO] Executing tasks
     [copy] Copying 2 files to /home/continuum/data/working-directory/187/target/apidocs/META-INF
[INFO] Executed tasks
[INFO] [resources:resources]
[INFO] Using default encoding to copy filtered resources.
[INFO] [compiler:compile]
[INFO] Compiling 60 source files to /home/continuum/data/working-directory/187/target/classes
[INFO] [bundle:manifest {execution: bundle-manifest}]
[INFO] [resources:testResources]
[INFO] Using default encoding to copy filtered resources.
[INFO] [compiler:testCompile]
[INFO] Compiling 17 source files to /home/continuum/data/working-directory/187/target/test-classes
[INFO] [surefire:test]
[INFO] Surefire report directory: /home/continuum/data/working-directory/187/target/surefire-reports

-------------------------------------------------------
 T E S T S
-------------------------------------------------------
Running org.apache.commons.pipeline.stage.KeyWaitBufferStageTest
Tests run: 2, Failures: 0, Errors: 0, Skipped: 0, Time elapsed: 0.257 sec
Running org.apache.commons.pipeline.stage.AddToCollectionStageTest
Tests run: 1, Failures: 0, Errors: 0, Skipped: 0, Time elapsed: 0.019 sec
Running org.apache.commons.pipeline.stage.DynamicLookupStaticMethodStageTest
Tests run: 1, Failures: 0, Errors: 0, Skipped: 0, Time elapsed: 0.022 sec
Running org.apache.commons.pipeline.driver.SynchronousStageDriverTest
Tests run: 4, Failures: 0, Errors: 0, Skipped: 0, Time elapsed: 0.058 sec
Running org.apache.commons.pipeline.stage.InputStreamLineBreakStageTest
Tests run: 1, Failures: 0, Errors: 0, Skipped: 0, Time elapsed: 0.014 sec
Running org.apache.commons.pipeline.stage.URLToInputStreamStageTest
Tests run: 2, Failures: 0, Errors: 0, Skipped: 0, Time elapsed: 0.027 sec
Running org.apache.commons.pipeline.stage.InvokeStaticMethodStageTest
Tests run: 2, Failures: 0, Errors: 0, Skipped: 0, Time elapsed: 0.029 sec
Running org.apache.commons.pipeline.stage.AbstractStageTest
Tests run: 1, Failures: 1, Errors: 0, Skipped: 0, Time elapsed: 0.014 sec <<< FAILURE!
Running org.apache.commons.pipeline.PipelineTest
Tests run: 6, Failures: 0, Errors: 0, Skipped: 0, Time elapsed: 0.048 sec
Running org.apache.commons.pipeline.config.DigesterPipelineFactoryTest
Tests run: 1, Failures: 0, Errors: 0, Skipped: 0, Time elapsed: 2.124 sec
Running org.apache.commons.pipeline.driver.DedicatedThreadStageDriverTest
Tests run: 5, Failures: 0, Errors: 0, Skipped: 0, Time elapsed: 3.847 sec
Running org.apache.commons.pipeline.stage.HttpFileDownloadStageTest
Tests run: 1, Failures: 0, Errors: 0, Skipped: 0, Time elapsed: 0.158 sec
Running org.apache.commons.pipeline.driver.ThreadPoolStageDriverTest
Tests run: 5, Failures: 0, Errors: 0, Skipped: 0, Time elapsed: 4.264 sec
Running org.apache.commons.pipeline.stage.InvokeMethodStageTest
Tests run: 2, Failures: 0, Errors: 0, Skipped: 0, Time elapsed: 0.027 sec

Results :

Failed tests: 
  warning(junit.framework.TestSuite$1)

Tests run: 34, Failures: 1, Errors: 0, Skipped: 0

[INFO] ------------------------------------------------------------------------
[ERROR] BUILD FAILURE
[INFO] ------------------------------------------------------------------------
[INFO] There are test failures.

Please refer to /home/continuum/data/working-directory/187/target/surefire-reports for the
individual test results.
[INFO] ------------------------------------------------------------------------
[INFO] For more information, run Maven with the -e switch
[INFO] ------------------------------------------------------------------------
[INFO] Total time: 23 seconds
[INFO] Finished at: Wed May 07 20:46:08 PDT 2008
[INFO] Final Memory: 11M/22M
[INFO] ------------------------------------------------------------------------

****************************************************************************



---------------------------------------------------------------------
To unsubscribe, e-mail: dev-unsubscribe@commons.apache.org
For additional commands, e-mail: dev-help@commons.apache.org


Mime
View raw message