commons-dev mailing list archives

Site index · List index
Message view « Date » · « Thread »
Top « Date » · « Thread »
From Continuum VMBuild Server <contin...@apache.org>
Subject [continuum] BUILD FAILURE: Commons Monitoring (Sandbox)
Date Mon, 07 Apr 2008 14:18:09 GMT
Online report : http://vmbuild.apache.org/continuum/buildResult.action?buildId=74160&projectId=538

Build statistics:
  State: Failed
  Previous State: Ok
  Started at: Mon 7 Apr 2008 07:17:34 -0700
  Finished at: Mon 7 Apr 2008 07:17:57 -0700
  Total time: 23s
  Build Trigger: Schedule
  Build Number: 3
  Exit code: 1
  Building machine hostname: vmbuild.apache.org
  Operating system : Linux(unknown)
  Java Home version : 
          java version "1.5.0_12"
          Java(TM) 2 Runtime Environment, Standard Edition (build 1.5.0_12-b04)
          Java HotSpot(TM) Client VM (build 1.5.0_12-b04, mixed mode, sharing)
        
  Builder version :
          Maven version: 2.0.7
          Java version: 1.5.0_12
          OS name: "linux" version: "2.6.20-16-server" arch: "i386"
    
****************************************************************************
SCM Changes:
****************************************************************************
Changed: nicolas @ Mon 7 Apr 2008 07:13:13 -0700
Comment: historization of repository based on a decorator :
- complete Detachable interface
- EmptyMonitor to avoid nullPointer
- enhance Reporter to support detachable
- Refactored MonitoringListener for webapps
Files changed:
  /commons/sandbox/monitoring/trunk/src/main/java/org/apache/commons/monitoring/Monitor.java
( 645530 )
  /commons/sandbox/monitoring/trunk/src/main/java/org/apache/commons/monitoring/listeners/Detachable.java
( 645530 )
  /commons/sandbox/monitoring/trunk/src/main/java/org/apache/commons/monitoring/listeners/EmpyMonitor.java
( 645530 )
  /commons/sandbox/monitoring/trunk/src/main/java/org/apache/commons/monitoring/listeners/HistorizedRepositoryDecorator.java
( 645530 )
  /commons/sandbox/monitoring/trunk/src/main/java/org/apache/commons/monitoring/listeners/SecondaryMonitor.java
( 645530 )
  /commons/sandbox/monitoring/trunk/src/main/java/org/apache/commons/monitoring/listeners/SecondaryRepository.java
( 645530 )
  /commons/sandbox/monitoring/trunk/src/main/java/org/apache/commons/monitoring/reporting/AbstractPeriodicLogger.java
( 645530 )
  /commons/sandbox/monitoring/trunk/src/main/java/org/apache/commons/monitoring/reporting/AbstractRenderer.java
( 645530 )
  /commons/sandbox/monitoring/trunk/src/main/java/org/apache/commons/monitoring/reporting/HtmlRenderer.java
( 645530 )
  /commons/sandbox/monitoring/trunk/src/main/java/org/apache/commons/monitoring/reporting/JsonRenderer.java
( 645530 )
  /commons/sandbox/monitoring/trunk/src/main/java/org/apache/commons/monitoring/reporting/OptionsSupport.java
( 645530 )
  /commons/sandbox/monitoring/trunk/src/main/java/org/apache/commons/monitoring/reporting/Renderer.java
( 645530 )
  /commons/sandbox/monitoring/trunk/src/main/java/org/apache/commons/monitoring/reporting/Selector.java
( 645530 )
  /commons/sandbox/monitoring/trunk/src/main/java/org/apache/commons/monitoring/reporting/TxtRenderer.java
( 645530 )
  /commons/sandbox/monitoring/trunk/src/main/java/org/apache/commons/monitoring/reporting/XmlRenderer.java
( 645530 )
  /commons/sandbox/monitoring/trunk/src/main/java/org/apache/commons/monitoring/reporting/web/MonitoringServlet.java
( 645530 )
  /commons/sandbox/monitoring/trunk/src/main/java/org/apache/commons/monitoring/servlet/MonitoringListener.java
( 645530 )
  /commons/sandbox/monitoring/trunk/src/main/webapp/WEB-INF/web.xml ( 645530 )

****************************************************************************
Dependencies Changes:
****************************************************************************
No dependencies changed


****************************************************************************
Build Defintion:
****************************************************************************
POM filename: pom.xml
Goals: clean deploy   
Arguments: --batch-mode -DaltDeploymentRepository=vmbuild.repo::default::file://localhost/home/continuum/data/commons
-Pci
Build Fresh: false
Always Build: false
Default Build Definition: true
Schedule: COMMONS_SCHEDULE
Profile Name: Java 5
Description: 


****************************************************************************
Test Summary:
****************************************************************************
Tests: 26
Failures: 3
Total time: 3389

****************************************************************************
Output:
****************************************************************************
[INFO] Scanning for projects...
[INFO] ----------------------------------------------------------------------------
[INFO] Building Commons Monitoring (Sandbox)
[INFO]    task-segment: [clean, deploy]
[INFO] ----------------------------------------------------------------------------
[INFO] [clean:clean]
[INFO] Deleting directory /home/continuum/data/working-directory/538/target
[INFO] Deleting directory /home/continuum/data/working-directory/538/target/classes
[INFO] Deleting directory /home/continuum/data/working-directory/538/target/test-classes
[INFO] Deleting directory /home/continuum/data/working-directory/538/target/site
[INFO] [antrun:run {execution: javadoc.resources}]
[INFO] Executing tasks
     [copy] Copying 2 files to /home/continuum/data/working-directory/538/target/apidocs/META-INF
[INFO] Executed tasks
[INFO] [resources:resources]
[INFO] Using default encoding to copy filtered resources.
[INFO] [compiler:compile]
[INFO] Compiling 61 source files to /home/continuum/data/working-directory/538/target/classes
[INFO] [resources:testResources]
[INFO] Using default encoding to copy filtered resources.
[INFO] [compiler:testCompile]
[INFO] Compiling 12 source files to /home/continuum/data/working-directory/538/target/test-classes
[INFO] [surefire:test]
[INFO] Surefire report directory: /home/continuum/data/working-directory/538/target/surefire-reports

-------------------------------------------------------
 T E S T S
-------------------------------------------------------
Running org.apache.commons.monitoring.impl.DefaultRepositoryTest
Tests run: 2, Failures: 0, Errors: 0, Skipped: 0, Time elapsed: 0.061 sec
Running org.apache.commons.monitoring.impl.ThreadSafeCounterTest
Tests run: 2, Failures: 0, Errors: 0, Skipped: 0, Time elapsed: 0.016 sec
Running org.apache.commons.monitoring.UnitTest
Tests run: 1, Failures: 0, Errors: 0, Skipped: 0, Time elapsed: 0.005 sec
Running org.apache.commons.monitoring.StopWatchTest
paused after 1ns
running for 1ns
stoped after 2ns
Tests run: 2, Failures: 0, Errors: 0, Skipped: 0, Time elapsed: 0.01 sec
Running org.apache.commons.monitoring.MonitoringTest
500000 executions took 3205263000ns
Tests run: 2, Failures: 0, Errors: 0, Skipped: 0, Time elapsed: 3.216 sec
Running org.apache.commons.monitoring.listener.SecondaryReposioryTest
Tests run: 1, Failures: 1, Errors: 0, Skipped: 0, Time elapsed: 0.019 sec <<< FAILURE!
Running org.apache.commons.monitoring.ExecutionStackTest
Tests run: 1, Failures: 0, Errors: 0, Skipped: 0, Time elapsed: 0.012 sec
Running org.apache.commons.monitoring.impl.CompositeValuesMonitorTest
Tests run: 3, Failures: 0, Errors: 0, Skipped: 0, Time elapsed: 0.009 sec
Running org.apache.commons.monitoring.reporting.SelectorTest
Tests run: 4, Failures: 0, Errors: 2, Skipped: 0, Time elapsed: 0.028 sec <<< FAILURE!
Running org.apache.commons.monitoring.impl.ThreadSafeGaugeTest
Tests run: 2, Failures: 0, Errors: 0, Skipped: 0, Time elapsed: 0.005 sec
Running org.apache.commons.monitoring.reporting.RendererTest
Tests run: 5, Failures: 0, Errors: 0, Skipped: 0, Time elapsed: 0.049 sec
Running org.apache.commons.monitoring.listener.ThresholdListenerTest
Tests run: 1, Failures: 0, Errors: 0, Skipped: 0, Time elapsed: 0.01 sec

Results :

Failed tests: 
  testSecondaryRepository(org.apache.commons.monitoring.listener.SecondaryReposioryTest)

Tests in error: 
  testSinglePathGet(org.apache.commons.monitoring.reporting.SelectorTest)
  testMultiplePath(org.apache.commons.monitoring.reporting.SelectorTest)

Tests run: 26, Failures: 1, Errors: 2, Skipped: 0

[INFO] ------------------------------------------------------------------------
[ERROR] BUILD FAILURE
[INFO] ------------------------------------------------------------------------
[INFO] There are test failures.

Please refer to /home/continuum/data/working-directory/538/target/surefire-reports for the
individual test results.
[INFO] ------------------------------------------------------------------------
[INFO] For more information, run Maven with the -e switch
[INFO] ------------------------------------------------------------------------
[INFO] Total time: 15 seconds
[INFO] Finished at: Mon Apr 07 07:17:57 PDT 2008
[INFO] Final Memory: 9M/23M
[INFO] ------------------------------------------------------------------------

****************************************************************************



---------------------------------------------------------------------
To unsubscribe, e-mail: dev-unsubscribe@commons.apache.org
For additional commands, e-mail: dev-help@commons.apache.org


Mime
View raw message