commons-dev mailing list archives

Site index · List index
Message view « Date » · « Thread »
Top « Date » · « Thread »
From Continuum VMBuild Server <contin...@apache.org>
Subject [continuum] BUILD FAILURE: Commons BeanUtils
Date Thu, 03 Apr 2008 07:53:04 GMT
Online report : http://vmbuild.apache.org/continuum/buildResult.action?buildId=72693&projectId=156

Build statistics:
  State: Failed
  Previous State: Failed
  Started at: Thu 3 Apr 2008 00:49:50 -0700
  Finished at: Thu 3 Apr 2008 00:52:40 -0700
  Total time: 2m 49s
  Build Trigger: Schedule
  Build Number: 14
  Exit code: 1
  Building machine hostname: vmbuild.apache.org
  Operating system : Linux(unknown)
  Java Home version : 
          java version "1.5.0_12"
          Java(TM) 2 Runtime Environment, Standard Edition (build 1.5.0_12-b04)
          Java HotSpot(TM) Client VM (build 1.5.0_12-b04, mixed mode, sharing)
        
  Builder version :
          Maven version: 2.0.7
          Java version: 1.5.0_12
          OS name: "linux" version: "2.6.20-16-server" arch: "i386"
    
****************************************************************************
SCM Changes:
****************************************************************************
Changed: niallp @ Wed 2 Apr 2008 20:00:34 -0700
Comment: BEANUTILS-298 - MethodUtils.getAccessibleMethod(Method method) could not find right
public method - reported by Roman Mukhin
Files changed:
  /commons/proper/beanutils/trunk/src/java/org/apache/commons/beanutils/BeanUtilsBean.java
( 644143 )
  /commons/proper/beanutils/trunk/src/java/org/apache/commons/beanutils/MethodUtils.java (
644143 )
  /commons/proper/beanutils/trunk/src/java/org/apache/commons/beanutils/PropertyUtilsBean.java
( 644143 )
  /commons/proper/beanutils/trunk/src/test/org/apache/commons/beanutils/bugs/Jira298TestCase.java
( 644143 )
  /commons/proper/beanutils/trunk/src/test/org/apache/commons/beanutils/bugs/other/Jira298BeanFactory.java
( 644143 )

****************************************************************************
Dependencies Changes:
****************************************************************************
No dependencies changed


****************************************************************************
Build Defintion:
****************************************************************************
POM filename: pom.xml
Goals: clean deploy   
Arguments: --batch-mode -DaltDeploymentRepository=vmbuild.repo::default::file://localhost/home/continuum/data/commons
-Pci
Build Fresh: false
Always Build: false
Default Build Definition: true
Schedule: COMMONS_SCHEDULE
Profile Name: Java 5
Description: 


****************************************************************************
Test Summary:
****************************************************************************
Tests: 1152
Failures: 6
Total time: 76406

****************************************************************************
Output:
****************************************************************************
[INFO] Scanning for projects...
[INFO] ----------------------------------------------------------------------------
[INFO] Building Commons BeanUtils
[INFO]    task-segment: [clean, deploy]
[INFO] ----------------------------------------------------------------------------
[INFO] [clean:clean]
[INFO] Deleting directory /home/continuum/data/working-directory/156/target
[INFO] Deleting directory /home/continuum/data/working-directory/156/target/classes
[INFO] Deleting directory /home/continuum/data/working-directory/156/target/test-classes
[INFO] Deleting directory /home/continuum/data/working-directory/156/target/site
Downloading: http://repo1.maven.org/maven2/commons-collections/commons-collections-testframework/3.2/commons-collections-testframework-3.2.pom
[INFO] [antrun:run {execution: javadoc.resources}]
[INFO] Executing tasks
     [copy] Copying 2 files to /home/continuum/data/working-directory/156/target/apidocs/META-INF
[INFO] Executed tasks
[INFO] [resources:resources]
[INFO] Using default encoding to copy filtered resources.
[INFO] [compiler:compile]
[INFO] Compiling 100 source files to /home/continuum/data/working-directory/156/target/classes
[INFO] [bundle:manifest {execution: bundle-manifest}]
[INFO] [resources:testResources]
[INFO] Using default encoding to copy filtered resources.
[INFO] [compiler:testCompile]
[INFO] Compiling 124 source files to /home/continuum/data/working-directory/156/target/test-classes
[INFO] [surefire:test]
[INFO] Surefire report directory: /home/continuum/data/working-directory/156/target/surefire-reports

-------------------------------------------------------
 T E S T S
-------------------------------------------------------
Running org.apache.commons.beanutils.DynaBeanMapDecoratorTestCase
Tests run: 13, Failures: 0, Errors: 0, Skipped: 0, Time elapsed: 0.205 sec
Running org.apache.commons.beanutils.bugs.Jira157TestCase
Tests run: 3, Failures: 0, Errors: 0, Skipped: 0, Time elapsed: 0.192 sec
Running org.apache.commons.beanutils.BeanPropertyValueChangeClosureTestCase
[WARN] BeanPropertyValueChangeClosure - WARNING: Unable to execute Closure. Null value encountered
in property path...org.apache.commons.beanutils.NestedNullException: Null property value for
'anotherNested.stringProperty' on bean class 'class org.apache.commons.beanutils.TestBean'
Tests run: 26, Failures: 0, Errors: 0, Skipped: 0, Time elapsed: 0.347 sec
Running org.apache.commons.beanutils.BeanMapTestCase
Tests run: 129, Failures: 0, Errors: 0, Skipped: 0, Time elapsed: 0.392 sec
Running org.apache.commons.beanutils.bugs.Jira61TestCase
Tests run: 16, Failures: 0, Errors: 0, Skipped: 0, Time elapsed: 0.194 sec
Running org.apache.commons.beanutils.MappedPropertyTestCase
Tests run: 17, Failures: 0, Errors: 0, Skipped: 0, Time elapsed: 0.182 sec
Running org.apache.commons.beanutils.converters.BooleanArrayConverterTestCase
Tests run: 9, Failures: 0, Errors: 0, Skipped: 0, Time elapsed: 0.154 sec
Running org.apache.commons.beanutils.expression.DefaultResolverTestCase
Tests run: 7, Failures: 0, Errors: 0, Skipped: 0, Time elapsed: 0.064 sec
Running org.apache.commons.beanutils.bugs.Jira87TestCase
Tests run: 1, Failures: 0, Errors: 0, Skipped: 0, Time elapsed: 0.241 sec
Running org.apache.commons.beanutils.DynaResultSetTestCase
Tests run: 7, Failures: 0, Errors: 0, Skipped: 0, Time elapsed: 0.14 sec
Running org.apache.commons.beanutils.converters.BigDecimalConverterTestCase
[WARN] BigDecimalConverter -     BigDecimalConverter cannot handle conversion to 'Object'
Tests run: 17, Failures: 0, Errors: 0, Skipped: 0, Time elapsed: 0.464 sec
Running org.apache.commons.beanutils.converters.SqlTimestampConverterTestCase
[WARN] SqlTimestampConverter -     SqlTimestampConverter cannot handle conversion to 'Character'
Tests run: 11, Failures: 0, Errors: 0, Skipped: 0, Time elapsed: 0.191 sec
Running org.apache.commons.beanutils.converters.IntegerConverterTestCase
[WARN] IntegerConverter -     IntegerConverter cannot handle conversion to 'Object'
Tests run: 18, Failures: 0, Errors: 0, Skipped: 0, Time elapsed: 0.198 sec
Running org.apache.commons.beanutils.WrapDynaBeanTestCase
Tests run: 39, Failures: 0, Errors: 0, Skipped: 0, Time elapsed: 0.349 sec
Running org.apache.commons.beanutils.bugs.Jira18TestCase
Tests run: 12, Failures: 0, Errors: 0, Skipped: 0, Time elapsed: 0.2 sec
Running org.apache.commons.beanutils.BeanComparatorTestCase
Tests run: 8, Failures: 0, Errors: 0, Skipped: 0, Time elapsed: 0.201 sec
Running org.apache.commons.beanutils.DynaPropertyTestCase
Tests run: 2, Failures: 0, Errors: 0, Skipped: 0, Time elapsed: 0.054 sec
Running org.apache.commons.beanutils.locale.LocaleBeanUtilsTestCase
Tests run: 2, Failures: 0, Errors: 0, Skipped: 0, Time elapsed: 0.29 sec
Running org.apache.commons.beanutils.converters.CharacterConverterTestCase
Tests run: 3, Failures: 0, Errors: 0, Skipped: 0, Time elapsed: 0.078 sec
Running org.apache.commons.beanutils.converters.ByteConverterTestCase
[WARN] ByteConverter -     ByteConverter cannot handle conversion to 'Object'
Tests run: 18, Failures: 0, Errors: 0, Skipped: 0, Time elapsed: 0.195 sec
Running org.apache.commons.beanutils.converters.ClassConverterTestCase
Tests run: 6, Failures: 0, Errors: 0, Skipped: 0, Time elapsed: 0.167 sec
Running org.apache.commons.beanutils.BeanificationTestCase
Tests run: 8, Failures: 0, Errors: 0, Skipped: 0, Time elapsed: 0.372 sec
Running org.apache.commons.beanutils.BeanToPropertyValueTransformerTestCase
[WARN] BeanToPropertyValueTransformer - WARNING: Problem during transformation. Null value
encountered in property path...org.apache.commons.beanutils.NestedNullException: Null property
value for 'anotherNested.stringProperty' on bean class 'class org.apache.commons.beanutils.TestBean'
Tests run: 17, Failures: 0, Errors: 0, Skipped: 0, Time elapsed: 0.21 sec
Running org.apache.commons.beanutils.BeanPropertyValueEqualsPredicateTestCase
[WARN] BeanPropertyValueEqualsPredicate - WARNING: Problem during evaluation. Null value encountered
in property path...org.apache.commons.beanutils.NestedNullException: Null property value for
'anotherNested.stringProperty' on bean class 'class org.apache.commons.beanutils.TestBean'
Tests run: 17, Failures: 0, Errors: 0, Skipped: 0, Time elapsed: 0.206 sec
Running org.apache.commons.beanutils.memoryleaktests.MemoryLeakTestCase
Tests run: 6, Failures: 6, Errors: 0, Skipped: 0, Time elapsed: 61.226 sec <<< FAILURE!
Running org.apache.commons.beanutils.locale.converters.FloatLocaleConverterTestCase
Tests run: 11, Failures: 0, Errors: 0, Skipped: 0, Time elapsed: 0.116 sec
Running org.apache.commons.beanutils.converters.BooleanConverterTestCase
Tests run: 5, Failures: 0, Errors: 0, Skipped: 0, Time elapsed: 0.094 sec
Running org.apache.commons.beanutils.LazyDynaBeanTestCase
Tests run: 16, Failures: 0, Errors: 0, Skipped: 0, Time elapsed: 0.182 sec
Running org.apache.commons.beanutils.converters.CalendarConverterTestCase
[WARN] CalendarConverter -     CalendarConverter cannot handle conversion to 'Character'
[WARN] CalendarConverter -     CalendarConverter does not support default String to 'Calendar'
conversion.
[WARN] CalendarConverter -     (N.B. Re-configure Converter or use alternative implementation)
Tests run: 11, Failures: 0, Errors: 0, Skipped: 0, Time elapsed: 0.152 sec
Running org.apache.commons.beanutils.locale.converters.IntegerLocaleConverterTestCase
Tests run: 11, Failures: 0, Errors: 0, Skipped: 0, Time elapsed: 0.128 sec
Running org.apache.commons.beanutils.locale.converters.BaseLocaleConverterTestCase
Tests run: 1, Failures: 0, Errors: 0, Skipped: 0, Time elapsed: 0.051 sec
Running org.apache.commons.beanutils.converters.FileConverterTestCase
Tests run: 1, Failures: 0, Errors: 0, Skipped: 0, Time elapsed: 0.074 sec
Running org.apache.commons.beanutils.converters.LongConverterTestCase
[WARN] LongConverter -     LongConverter cannot handle conversion to 'Object'
Tests run: 17, Failures: 0, Errors: 0, Skipped: 0, Time elapsed: 0.191 sec
Running org.apache.commons.beanutils.PropertyUtilsTestCase
Tests run: 109, Failures: 0, Errors: 0, Skipped: 0, Time elapsed: 0.404 sec
Running org.apache.commons.beanutils.LazyDynaMapTestCase
Tests run: 17, Failures: 0, Errors: 0, Skipped: 0, Time elapsed: 0.249 sec
Running org.apache.commons.beanutils.locale.LocaleConvertUtilsTestCase
Tests run: 5, Failures: 0, Errors: 0, Skipped: 0, Time elapsed: 0.278 sec
Running org.apache.commons.beanutils.converters.DateConverterTestCase
[WARN] DateConverter -     DateConverter cannot handle conversion to 'Character'
[WARN] DateConverter -     DateConverter does not support default String to 'Date' conversion.
[WARN] DateConverter -     (N.B. Re-configure Converter or use alternative implementation)
Tests run: 11, Failures: 0, Errors: 0, Skipped: 0, Time elapsed: 0.137 sec
Running org.apache.commons.beanutils.locale.converters.DoubleLocaleConverterTestCase
Tests run: 10, Failures: 0, Errors: 0, Skipped: 0, Time elapsed: 0.099 sec
Running org.apache.commons.beanutils.converters.DoubleConverterTestCase
[WARN] DoubleConverter -     DoubleConverter cannot handle conversion to 'Object'
Tests run: 17, Failures: 0, Errors: 0, Skipped: 0, Time elapsed: 0.225 sec
Running org.apache.commons.beanutils.converters.StringArrayConverterTestCase
Tests run: 1, Failures: 0, Errors: 0, Skipped: 0, Time elapsed: 0.077 sec
Running org.apache.commons.beanutils.LazyDynaListTestCase
Tests run: 10, Failures: 0, Errors: 0, Skipped: 0, Time elapsed: 0.321 sec
Running org.apache.commons.beanutils.BeanUtils2TestCase
Tests run: 55, Failures: 0, Errors: 0, Skipped: 0, Time elapsed: 0.484 sec
Running org.apache.commons.beanutils.converters.SqlDateConverterTestCase
[WARN] SqlDateConverter -     SqlDateConverter cannot handle conversion to 'Character'
Tests run: 12, Failures: 0, Errors: 0, Skipped: 0, Time elapsed: 0.14 sec
Running org.apache.commons.beanutils.locale.converters.ByteLocaleConverterTestCase
Tests run: 10, Failures: 0, Errors: 0, Skipped: 0, Time elapsed: 0.092 sec
Running org.apache.commons.beanutils.converters.ClassReloaderTestCase
Tests run: 1, Failures: 0, Errors: 0, Skipped: 0, Time elapsed: 0.058 sec
Running org.apache.commons.beanutils.DynaRowSetTestCase
Tests run: 9, Failures: 0, Errors: 0, Skipped: 0, Time elapsed: 0.156 sec
Running org.apache.commons.beanutils.locale.converters.LongLocaleConverterTestCase
Tests run: 10, Failures: 0, Errors: 0, Skipped: 0, Time elapsed: 0.095 sec
Running org.apache.commons.beanutils.bugs.Jira273TestCase
Tests run: 6, Failures: 0, Errors: 0, Skipped: 0, Time elapsed: 0.177 sec
Running org.apache.commons.beanutils.LazyDynaClassTestCase
Tests run: 15, Failures: 0, Errors: 0, Skipped: 0, Time elapsed: 0.081 sec
Running org.apache.commons.beanutils.IndexedPropertyTestCase
Tests run: 29, Failures: 0, Errors: 0, Skipped: 0, Time elapsed: 0.406 sec
Running org.apache.commons.beanutils.converters.BigIntegerConverterTestCase
[WARN] BigIntegerConverter -     BigIntegerConverter cannot handle conversion to 'Object'
Tests run: 17, Failures: 0, Errors: 0, Skipped: 0, Time elapsed: 0.2 sec
Running org.apache.commons.beanutils.converters.FloatConverterTestCase
[WARN] FloatConverter -     FloatConverter cannot handle conversion to 'Object'
Tests run: 18, Failures: 0, Errors: 0, Skipped: 0, Time elapsed: 0.271 sec
Running org.apache.commons.beanutils.locale.converters.ShortLocaleConverterTestCase
Tests run: 10, Failures: 0, Errors: 0, Skipped: 0, Time elapsed: 0.095 sec
Running org.apache.commons.beanutils.locale.converters.BigDecimalLocaleConverterTestCase
Tests run: 10, Failures: 0, Errors: 0, Skipped: 0, Time elapsed: 0.149 sec
Running org.apache.commons.beanutils.bugs.Jira92TestCase
Tests run: 1, Failures: 0, Errors: 0, Skipped: 0, Time elapsed: 0.239 sec
Running org.apache.commons.beanutils.BeanPredicateTestCase
Tests run: 4, Failures: 0, Errors: 0, Skipped: 0, Time elapsed: 0.236 sec
Running org.apache.commons.beanutils.ConstructorUtilsTestCase
Tests run: 9, Failures: 0, Errors: 0, Skipped: 0, Time elapsed: 0.071 sec
Running org.apache.commons.beanutils.locale.converters.BigIntegerLocaleConverterTestCase
Tests run: 10, Failures: 0, Errors: 0, Skipped: 0, Time elapsed: 0.09 sec
Running org.apache.commons.beanutils.converters.ShortConverterTestCase
[WARN] ShortConverter -     ShortConverter cannot handle conversion to 'Object'
Tests run: 18, Failures: 0, Errors: 0, Skipped: 0, Time elapsed: 0.243 sec
Running org.apache.commons.beanutils.converters.ArrayConverterTestCase
Tests run: 7, Failures: 0, Errors: 0, Skipped: 0, Time elapsed: 0.098 sec
Running org.apache.commons.beanutils.ConvertUtilsTestCase
Tests run: 12, Failures: 0, Errors: 0, Skipped: 0, Time elapsed: 0.216 sec
Running org.apache.commons.beanutils.locale.LocaleBeanificationTestCase
Tests run: 9, Failures: 0, Errors: 0, Skipped: 0, Time elapsed: 1.551 sec
Running org.apache.commons.beanutils.locale.converters.DateLocaleConverterTestCase
Tests run: 14, Failures: 0, Errors: 0, Skipped: 0, Time elapsed: 0.186 sec
Running org.apache.commons.beanutils.converters.URLConverterTestCase
Tests run: 1, Failures: 0, Errors: 0, Skipped: 0, Time elapsed: 0.988 sec
Running org.apache.commons.beanutils.MethodUtilsTestCase
Tests run: 12, Failures: 0, Errors: 0, Skipped: 0, Time elapsed: 0.11 sec
Running org.apache.commons.beanutils.bugs.Jira298TestCase
Tests run: 3, Failures: 0, Errors: 0, Skipped: 0, Time elapsed: 0.158 sec
Running org.apache.commons.beanutils.DynaBeanUtilsTestCase
Tests run: 29, Failures: 0, Errors: 0, Skipped: 0, Time elapsed: 0.349 sec
Running org.apache.commons.beanutils.converters.SqlTimeConverterTestCase
[WARN] SqlTimeConverter -     SqlTimeConverter cannot handle conversion to 'Character'
Tests run: 11, Failures: 0, Errors: 0, Skipped: 0, Time elapsed: 0.146 sec
Running org.apache.commons.beanutils.BeanUtilsTestCase
Tests run: 55, Failures: 0, Errors: 0, Skipped: 0, Time elapsed: 0.599 sec
Running org.apache.commons.beanutils.BasicDynaBeanTestCase
Tests run: 35, Failures: 0, Errors: 0, Skipped: 0, Time elapsed: 0.176 sec
Running org.apache.commons.beanutils.DynaPropertyUtilsTestCase
Tests run: 55, Failures: 0, Errors: 0, Skipped: 0, Time elapsed: 0.282 sec

Results :

Failed tests: 

Tests run: 1152, Failures: 6, Errors: 0, Skipped: 0

[INFO] ------------------------------------------------------------------------
[ERROR] BUILD FAILURE
[INFO] ------------------------------------------------------------------------
[INFO] There are test failures.

Please refer to /home/continuum/data/working-directory/156/target/surefire-reports for the
individual test results.
[INFO] ------------------------------------------------------------------------
[INFO] For more information, run Maven with the -e switch
[INFO] ------------------------------------------------------------------------
[INFO] Total time: 2 minutes 41 seconds
[INFO] Finished at: Thu Apr 03 00:52:39 PDT 2008
[INFO] Final Memory: 12M/36M
[INFO] ------------------------------------------------------------------------

****************************************************************************



---------------------------------------------------------------------
To unsubscribe, e-mail: dev-unsubscribe@commons.apache.org
For additional commands, e-mail: dev-help@commons.apache.org


Mime
View raw message