commons-dev mailing list archives

Site index · List index
Message view « Date » · « Thread »
Top « Date » · « Thread »
From Continuum VMBuild Server <contin...@apache.org>
Subject [continuum] BUILD FAILURE: Commons Codec
Date Fri, 25 Apr 2008 11:48:02 GMT
Online report : http://vmbuild.apache.org/continuum/buildResult.action?buildId=80485&projectId=159

Build statistics:
  State: Failed
  Previous State: Failed
  Started at: Fri 25 Apr 2008 04:47:22 -0700
  Finished at: Fri 25 Apr 2008 04:47:47 -0700
  Total time: 25s
  Build Trigger: Schedule
  Build Number: 6
  Exit code: 1
  Building machine hostname: vmbuild.apache.org
  Operating system : Linux(unknown)
  Java Home version : 
          java version "1.5.0_12"
          Java(TM) 2 Runtime Environment, Standard Edition (build 1.5.0_12-b04)
          Java HotSpot(TM) Client VM (build 1.5.0_12-b04, mixed mode, sharing)
        
  Builder version :
          Maven version: 2.0.7
          Java version: 1.5.0_12
          OS name: "linux" version: "2.6.20-16-server" arch: "i386"
    
****************************************************************************
SCM Changes:
****************************************************************************
Changed: niallp @ Fri 25 Apr 2008 04:11:21 -0700
Comment: CODEC-64 set svn:eol-style to native and remove svn:executable property - thanks
to Benjamin Bentmann for the patch
Files changed:
  /commons/proper/codec/trunk/LICENSE.txt ( 651573 )
  /commons/proper/codec/trunk/RELEASE-NOTES-1.0-dev.txt ( 651573 )
  /commons/proper/codec/trunk/RELEASE-NOTES-1.3.txt ( 651573 )
  /commons/proper/codec/trunk/RELEASE-PLAN ( 651573 )
  /commons/proper/codec/trunk/TODO ( 651573 )
  /commons/proper/codec/trunk/maven.xml ( 651573 )
  /commons/proper/codec/trunk/project.properties ( 651573 )
  /commons/proper/codec/trunk/project.xml ( 651573 )
  /commons/proper/codec/trunk/src/java/org/apache/commons/codec/BinaryDecoder.java ( 651573
)
  /commons/proper/codec/trunk/src/java/org/apache/commons/codec/BinaryEncoder.java ( 651573
)
  /commons/proper/codec/trunk/src/java/org/apache/commons/codec/Decoder.java ( 651573 )
  /commons/proper/codec/trunk/src/java/org/apache/commons/codec/DecoderException.java ( 651573
)
  /commons/proper/codec/trunk/src/java/org/apache/commons/codec/EncoderException.java ( 651573
)
  /commons/proper/codec/trunk/src/java/org/apache/commons/codec/StringEncoder.java ( 651573
)
  /commons/proper/codec/trunk/src/java/org/apache/commons/codec/StringEncoderComparator.java
( 651573 )
  /commons/proper/codec/trunk/src/java/org/apache/commons/codec/binary/Base64.java ( 651573
)
  /commons/proper/codec/trunk/src/java/org/apache/commons/codec/binary/Hex.java ( 651573 )
  /commons/proper/codec/trunk/src/java/org/apache/commons/codec/language/Caverphone.java (
651573 )
  /commons/proper/codec/trunk/src/java/org/apache/commons/codec/language/Metaphone.java (
651573 )
  /commons/proper/codec/trunk/src/java/org/apache/commons/codec/language/RefinedSoundex.java
( 651573 )
  /commons/proper/codec/trunk/src/java/org/apache/commons/codec/language/Soundex.java ( 651573
)
  /commons/proper/codec/trunk/src/test/org/apache/commons/codec/BinaryEncoderAbstractTest.java
( 651573 )
  /commons/proper/codec/trunk/src/test/org/apache/commons/codec/StringEncoderAbstractTest.java
( 651573 )
  /commons/proper/codec/trunk/src/test/org/apache/commons/codec/StringEncoderComparatorTest.java
( 651573 )
  /commons/proper/codec/trunk/src/test/org/apache/commons/codec/binary/Base64Test.java ( 651573
)
  /commons/proper/codec/trunk/src/test/org/apache/commons/codec/binary/HexTest.java ( 651573
)
  /commons/proper/codec/trunk/src/test/org/apache/commons/codec/language/CaverphoneTest.java
( 651573 )
  /commons/proper/codec/trunk/src/test/org/apache/commons/codec/language/MetaphoneTest.java
( 651573 )
  /commons/proper/codec/trunk/src/test/org/apache/commons/codec/language/RefinedSoundexTest.java
( 651573 )
  /commons/proper/codec/trunk/src/test/org/apache/commons/codec/language/SoundexTest.java
( 651573 )
  /commons/proper/codec/trunk/xdocs/changes.xml ( 651573 )
  /commons/proper/codec/trunk/xdocs/cvs-usage.xml ( 651573 )
  /commons/proper/codec/trunk/xdocs/index.xml ( 651573 )
  /commons/proper/codec/trunk/xdocs/issue-tracking.xml ( 651573 )
  /commons/proper/codec/trunk/xdocs/navigation.xml ( 651573 )
  /commons/proper/codec/trunk/xdocs/userguide.xml ( 651573 )

****************************************************************************
Dependencies Changes:
****************************************************************************
No dependencies changed


****************************************************************************
Build Defintion:
****************************************************************************
POM filename: pom.xml
Goals: clean deploy   
Arguments: --batch-mode -DaltDeploymentRepository=vmbuild.repo::default::file://localhost/home/continuum/data/commons
-Pci
Build Fresh: false
Always Build: false
Default Build Definition: true
Schedule: COMMONS_SCHEDULE
Profile Name: Java 5
Description: 


****************************************************************************
Test Summary:
****************************************************************************
Tests: 201
Failures: 1
Total time: 2763

****************************************************************************
Output:
****************************************************************************
[INFO] Scanning for projects...
[INFO] ----------------------------------------------------------------------------
[INFO] Building Commons Codec
[INFO]    task-segment: [clean, deploy]
[INFO] ----------------------------------------------------------------------------
[INFO] [clean:clean]
[INFO] Deleting directory /home/continuum/data/working-directory/159/target
[INFO] Deleting directory /home/continuum/data/working-directory/159/target/classes
[INFO] Deleting directory /home/continuum/data/working-directory/159/target/test-classes
[INFO] Deleting directory /home/continuum/data/working-directory/159/target/site
[INFO] [antrun:run {execution: javadoc.resources}]
[INFO] Executing tasks
     [copy] Copying 2 files to /home/continuum/data/working-directory/159/target/apidocs/META-INF
[INFO] Executed tasks
[INFO] [resources:resources]
[INFO] Using default encoding to copy filtered resources.
[INFO] [compiler:compile]
[INFO] Compiling 25 source files to /home/continuum/data/working-directory/159/target/classes
[INFO] [bundle:manifest {execution: bundle-manifest}]
[INFO] [resources:testResources]
[INFO] Using default encoding to copy filtered resources.
[INFO] [compiler:testCompile]
[INFO] Compiling 18 source files to /home/continuum/data/working-directory/159/target/test-classes
[INFO] [surefire:test]
[INFO] Surefire report directory: /home/continuum/data/working-directory/159/target/surefire-reports

-------------------------------------------------------
 T E S T S
-------------------------------------------------------
Running org.apache.commons.codec.net.URLCodecTest
Tests run: 16, Failures: 0, Errors: 0, Skipped: 0, Time elapsed: 0.6 sec
Running org.apache.commons.codec.language.MetaphoneTest
Tests run: 33, Failures: 1, Errors: 0, Skipped: 0, Time elapsed: 0.341 sec <<< FAILURE!
Running org.apache.commons.codec.net.QuotedPrintableCodecTest
Tests run: 15, Failures: 0, Errors: 0, Skipped: 0, Time elapsed: 0.042 sec
Running org.apache.commons.codec.net.RFC1522CodecTest
Tests run: 2, Failures: 0, Errors: 0, Skipped: 0, Time elapsed: 0.009 sec
Running org.apache.commons.codec.net.QCodecTest
Tests run: 12, Failures: 0, Errors: 0, Skipped: 0, Time elapsed: 0.029 sec
Running org.apache.commons.codec.binary.HexTest
Tests run: 12, Failures: 0, Errors: 0, Skipped: 0, Time elapsed: 0.047 sec
Running org.apache.commons.codec.language.RefinedSoundexTest
Tests run: 6, Failures: 0, Errors: 0, Skipped: 0, Time elapsed: 0.017 sec
Running org.apache.commons.codec.binary.Base64Test
Tests run: 29, Failures: 0, Errors: 0, Skipped: 0, Time elapsed: 0.157 sec
Running org.apache.commons.codec.language.CaverphoneTest
Tests run: 4, Failures: 0, Errors: 0, Skipped: 0, Time elapsed: 0.038 sec
Running org.apache.commons.codec.digest.DigestUtilsTest
Tests run: 8, Failures: 0, Errors: 0, Skipped: 0, Time elapsed: 1.244 sec
Running org.apache.commons.codec.StringEncoderComparatorTest
Tests run: 4, Failures: 0, Errors: 0, Skipped: 0, Time elapsed: 0.046 sec
Running org.apache.commons.codec.language.SoundexTest
Tests run: 25, Failures: 0, Errors: 0, Skipped: 0, Time elapsed: 0.064 sec
Running org.apache.commons.codec.language.DoubleMetaphoneTest
Tests run: 13, Failures: 0, Errors: 0, Skipped: 0, Time elapsed: 0.215 sec
Running org.apache.commons.codec.net.BCodecTest
Tests run: 9, Failures: 0, Errors: 0, Skipped: 0, Time elapsed: 0.038 sec
Running org.apache.commons.codec.binary.BinaryCodecTest
Tests run: 13, Failures: 0, Errors: 0, Skipped: 0, Time elapsed: 0.032 sec

Results :

Failed tests: 
  testWhy(org.apache.commons.codec.language.MetaphoneTest)

Tests run: 201, Failures: 1, Errors: 0, Skipped: 0

[INFO] ------------------------------------------------------------------------
[ERROR] BUILD FAILURE
[INFO] ------------------------------------------------------------------------
[INFO] There are test failures.

Please refer to /home/continuum/data/working-directory/159/target/surefire-reports for the
individual test results.
[INFO] ------------------------------------------------------------------------
[INFO] For more information, run Maven with the -e switch
[INFO] ------------------------------------------------------------------------
[INFO] Total time: 19 seconds
[INFO] Finished at: Fri Apr 25 04:47:47 PDT 2008
[INFO] Final Memory: 12M/22M
[INFO] ------------------------------------------------------------------------

****************************************************************************



---------------------------------------------------------------------
To unsubscribe, e-mail: dev-unsubscribe@commons.apache.org
For additional commands, e-mail: dev-help@commons.apache.org


Mime
View raw message