commons-dev mailing list archives

Site index · List index
Message view « Date » · « Thread »
Top « Date » · « Thread »
From Continuum VMBuild Server <contin...@apache.org>
Subject [continuum] BUILD FAILURE: Commons Exec (Sandbox)
Date Sat, 12 Apr 2008 22:32:06 GMT
Online report : http://vmbuild.apache.org/continuum/buildResult.action?buildId=76278&projectId=178

Build statistics:
  State: Failed
  Previous State: Ok
  Started at: Sat 12 Apr 2008 15:30:37 -0700
  Finished at: Sat 12 Apr 2008 15:31:56 -0700
  Total time: 1m 18s
  Build Trigger: Schedule
  Build Number: 30
  Exit code: 1
  Building machine hostname: vmbuild.apache.org
  Operating system : Linux(unknown)
  Java Home version : 
          java version "1.5.0_12"
          Java(TM) 2 Runtime Environment, Standard Edition (build 1.5.0_12-b04)
          Java HotSpot(TM) Client VM (build 1.5.0_12-b04, mixed mode, sharing)
        
  Builder version :
          Maven version: 2.0.7
          Java version: 1.5.0_12
          OS name: "linux" version: "2.6.20-16-server" arch: "i386"
    
****************************************************************************
SCM Changes:
****************************************************************************
Changed: niallp @ Sat 12 Apr 2008 14:51:39 -0700
Comment: Add assembly descriptors
Files changed:
  /commons/sandbox/exec/trunk/pom.xml ( 647500 )
  /commons/sandbox/exec/trunk/src/assembly ( 647500 )
  /commons/sandbox/exec/trunk/src/assembly/bin.xml ( 647500 )
  /commons/sandbox/exec/trunk/src/assembly/src.xml ( 647500 )

****************************************************************************
Dependencies Changes:
****************************************************************************
No dependencies changed


****************************************************************************
Build Defintion:
****************************************************************************
POM filename: pom.xml
Goals: clean deploy   
Arguments: --batch-mode -DaltDeploymentRepository=vmbuild.repo::default::file://localhost/home/continuum/data/commons
-Pci
Build Fresh: false
Always Build: false
Default Build Definition: true
Schedule: COMMONS_SCHEDULE
Profile Name: Java 5
Description: 


****************************************************************************
Test Summary:
****************************************************************************
Tests: 55
Failures: 1
Total time: 60361

****************************************************************************
Output:
****************************************************************************
[INFO] Scanning for projects...
[INFO] ----------------------------------------------------------------------------
[INFO] Building Commons Exec (Sandbox)
[INFO]    task-segment: [clean, deploy]
[INFO] ----------------------------------------------------------------------------
[INFO] [clean:clean]
[INFO] Deleting directory /home/continuum/data/working-directory/178/target
[INFO] Deleting directory /home/continuum/data/working-directory/178/target/classes
[INFO] Deleting directory /home/continuum/data/working-directory/178/target/test-classes
[INFO] Deleting directory /home/continuum/data/working-directory/178/target/site
[INFO] [antrun:run {execution: javadoc.resources}]
[INFO] Executing tasks
     [copy] Copying 2 files to /home/continuum/data/working-directory/178/target/apidocs/META-INF
[INFO] Executed tasks
[INFO] [resources:resources]
[INFO] Using default encoding to copy filtered resources.
[INFO] [compiler:compile]
[INFO] Compiling 29 source files to /home/continuum/data/working-directory/178/target/classes
[INFO] [resources:testResources]
[INFO] Using default encoding to copy filtered resources.
[INFO] [compiler:testCompile]
[INFO] Compiling 8 source files to /home/continuum/data/working-directory/178/target/test-classes
[INFO] [surefire:test]
[INFO] Surefire report directory: /home/continuum/data/working-directory/178/target/surefire-reports

-------------------------------------------------------
 T E S T S
-------------------------------------------------------
Running org.apache.commons.exec.environment.EnvironmentUtilTest
ANT_HOME=/opt/apache-ant-1.7.0
XFILESEARCHPATH=/usr/dt/app-defaults/%L/Dt
LANG=en_US.UTF-8
SUDO_COMMAND=/etc/init.d/continuum restart
PWD=/home/continuum/data/working-directory/178
SUDO_USER=wsmoak
SUDO_GID=1006
WRAPPER_BITS=32
USER=root
WRAPPER_OS=windows
NLSPATH=/usr/dt/lib/nls/msg/%L/%N.cat
WRAPPER_ARCH=x86
WRAPPER_PATH_SEPARATOR=:
MAVEN_TERMINATE_CMD=on
HOME=/home/wsmoak
PLEXUS_HOME=/opt/continuum-1.1-beta-3
TOOLS_JAR=/usr/lib/jvm/java-6-sun/lib/tools.jar
LESSOPEN=| /usr/bin/lesspipe %s
LD_LIBRARY_PATH=/usr/lib/jvm/jdk1.5.0_12/jre/lib/i386/client:/usr/lib/jvm/jdk1.5.0_12/jre/lib/i386:/usr/lib/jvm/jdk1.5.0_12/jre/../lib/i386:/usr/lib/jvm/jdk1.6.0_05/jre/lib/i386/client:/usr/lib/jvm/jdk1.6.0_05/jre/lib/i386:/usr/lib/jvm/jdk1.6.0_05/jre/../lib/i386
LESSCLOSE=/usr/bin/lesspipe %s %s
SSH_CONNECTION=68.3.241.21 52493 140.211.11.137 22
LOGNAME=root
SHELL=/bin/bash
SUDO_UID=1006
SSH_TTY=/dev/pts/1
SHLVL=1
WRAPPER_FILE_SEPARATOR=/
HISTCONTROL=ignoreboth
MAVEN_HOME=/opt/maven-1.0.2
M2_HOME=/opt/maven-2.0.7
SSH_CLIENT=68.3.241.21 52493 22
MAIL=/var/mail/wsmoak
JAVA_HOME=/usr/lib/jvm/jdk1.5.0_12/
LS_COLORS=no=00:fi=00:di=01;34:ln=01;36:pi=40;33:so=01;35:do=01;35:bd=40;33;01:cd=40;33;01:or=40;31;01:su=37;41:sg=30;43:tw=30;42:ow=34;42:st=37;44:ex=01;32:*.tar=01;31:*.tgz=01;31:*.arj=01;31:*.taz=01;31:*.lzh=01;31:*.zip=01;31:*.z=01;31:*.Z=01;31:*.gz=01;31:*.bz2=01;31:*.deb=01;31:*.rpm=01;31:*.jar=01;31:*.jpg=01;35:*.jpeg=01;35:*.gif=01;35:*.bmp=01;35:*.pbm=01;35:*.pgm=01;35:*.ppm=01;35:*.tga=01;35:*.xbm=01;35:*.xpm=01;35:*.tif=01;35:*.tiff=01;35:*.png=01;35:*.mov=01;35:*.mpg=01;35:*.mpeg=01;35:*.avi=01;35:*.fli=01;35:*.gl=01;35:*.dl=01;35:*.xcf=01;35:*.xwd=01;35:*.flac=01;35:*.mp3=01;35:*.mpc=01;35:*.ogg=01;35:*.wav=01;35:
PLEXUS_BASE=/opt/continuum-1.1-beta-3
OLDPWD=/home/continuum/data/working-directory/178
TERM=xterm-color
PATH=/opt/maven-2.0.7/bin:/usr/lib/jvm/java-6-sun/bin:/opt/apache-ant-1.7.0/bin:/opt/maven-1.0.2/bin:/usr/local/sbin:/usr/local/bin:/usr/sbin:/usr/bin:/sbin:/bin:/usr/X11R6/bin
Tests run: 2, Failures: 0, Errors: 0, Skipped: 0, Time elapsed: 0.086 sec
Running org.apache.commons.exec.CommandLineTest
Tests run: 25, Failures: 0, Errors: 0, Skipped: 0, Time elapsed: 0.038 sec
Running org.apache.commons.exec.util.MapUtilTest
Tests run: 3, Failures: 0, Errors: 0, Skipped: 0, Time elapsed: 0.007 sec
Running org.apache.commons.exec.TestUtilTest
Tests run: 7, Failures: 0, Errors: 0, Skipped: 0, Time elapsed: 0.008 sec
Running org.apache.commons.exec.DefaultExecutorTest
Tests run: 18, Failures: 1, Errors: 0, Skipped: 0, Time elapsed: 60.252 sec <<< FAILURE!

Results :

Failed tests: 
  testExecuteAsyncWithProcessDestroyer(org.apache.commons.exec.DefaultExecutorTest)

Tests run: 55, Failures: 1, Errors: 0, Skipped: 0

[INFO] ------------------------------------------------------------------------
[ERROR] BUILD FAILURE
[INFO] ------------------------------------------------------------------------
[INFO] There are test failures.

Please refer to /home/continuum/data/working-directory/178/target/surefire-reports for the
individual test results.
[INFO] ------------------------------------------------------------------------
[INFO] For more information, run Maven with the -e switch
[INFO] ------------------------------------------------------------------------
[INFO] Total time: 1 minute 10 seconds
[INFO] Finished at: Sat Apr 12 15:31:55 PDT 2008
[INFO] Final Memory: 8M/17M
[INFO] ------------------------------------------------------------------------

****************************************************************************



---------------------------------------------------------------------
To unsubscribe, e-mail: dev-unsubscribe@commons.apache.org
For additional commands, e-mail: dev-help@commons.apache.org


Mime
View raw message