commons-dev mailing list archives

Site index · List index
Message view « Date » · « Thread »
Top « Date » · « Thread »
From Continuum VMBuild Server <contin...@apache.org>
Subject [continuum] BUILD FAILURE: Commons Validator
Date Sun, 02 Mar 2008 20:28:40 GMT
Online report : http://vmbuild.apache.org/continuum/buildResult.action?buildId=58557&projectId=170

Build statistics:
  State: Failed
  Previous State: Ok
  Started at: Sun 2 Mar 2008 12:27:34 -0800
  Finished at: Sun 2 Mar 2008 12:28:30 -0800
  Total time: 56s
  Build Trigger: Schedule
  Build Number: 21
  Exit code: 1
  Building machine hostname: vmbuild.apache.org
  Operating system : Linux(unknown)
  Java Home version : 
          java version "1.4.2_15"
          Java(TM) 2 Runtime Environment, Standard Edition (build 1.4.2_15-b02)
          Java HotSpot(TM) Client VM (build 1.4.2_15-b02, mixed mode)
        
  Builder version :
          Maven version: 2.0.7
          Java version: 1.4.2_15
          OS name: "linux" version: "2.6.20-16-server" arch: "i386"
    
****************************************************************************
SCM Changes:
****************************************************************************
Changed: niallp @ Sun 2 Mar 2008 11:37:56 -0800
Comment: Upgrade to commons-parent-8 and add configuration properties for OSGi (maven-bundle-plugin)
and commons-build-plugin
Files changed:
  /commons/proper/beanutils/trunk/pom.xml ( 632815 )
  /commons/proper/betwixt/trunk/pom.xml ( 632815 )
  /commons/proper/chain/trunk/pom.xml ( 632815 )
  /commons/proper/cli/trunk/pom.xml ( 632815 )
  /commons/proper/codec/trunk/pom.xml ( 632815 )
  /commons/proper/collections/trunk/pom.xml ( 632815 )
  /commons/proper/configuration/trunk/pom.xml ( 632815 )
  /commons/proper/daemon/trunk/pom.xml ( 632815 )
  /commons/proper/dbcp/trunk/pom.xml ( 632815 )
  /commons/proper/dbutils/trunk/pom.xml ( 632815 )
  /commons/proper/digester/trunk/pom.xml ( 632815 )
  /commons/proper/discovery/trunk/pom.xml ( 632815 )
  /commons/proper/el/trunk/pom.xml ( 632815 )
  /commons/proper/email/trunk/pom.xml ( 632815 )
  /commons/proper/fileupload/trunk/pom.xml ( 632815 )
  /commons/proper/io/trunk/pom.xml ( 632815 )
  /commons/proper/jci/trunk/compilers/eclipse/pom.xml ( 632815 )
  /commons/proper/jci/trunk/compilers/groovy/pom.xml ( 632815 )
  /commons/proper/jci/trunk/compilers/janino/pom.xml ( 632815 )
  /commons/proper/jci/trunk/compilers/javac/pom.xml ( 632815 )
  /commons/proper/jci/trunk/compilers/jsr199/pom.xml ( 632815 )
  /commons/proper/jci/trunk/compilers/rhino/pom.xml ( 632815 )
  /commons/proper/jci/trunk/core/pom.xml ( 632815 )
  /commons/proper/jci/trunk/examples/pom.xml ( 632815 )
  /commons/proper/jci/trunk/fam/pom.xml ( 632815 )
  /commons/proper/jci/trunk/pom.xml ( 632815 )
  /commons/proper/jexl/trunk/pom.xml ( 632815 )
  /commons/proper/jxpath/trunk/pom.xml ( 632815 )
  /commons/proper/lang/trunk/pom.xml ( 632815 )
  /commons/proper/launcher/trunk/pom.xml ( 632815 )
  /commons/proper/logging/trunk/pom.xml ( 632815 )
  /commons/proper/math/trunk/pom.xml ( 632815 )
  /commons/proper/modeler/trunk/pom.xml ( 632815 )
  /commons/proper/net/trunk/pom.xml ( 632815 )
  /commons/proper/pool/trunk/pom.xml ( 632815 )
  /commons/proper/primitives/trunk/pom.xml ( 632815 )
  /commons/proper/proxy/trunk/pom.xml ( 632815 )
  /commons/proper/scxml/trunk/pom.xml ( 632815 )
  /commons/proper/transaction/trunk/pom.xml ( 632815 )
  /commons/proper/validator/trunk/pom.xml ( 632815 )
  /commons/proper/vfs/trunk/core/pom.xml ( 632815 )
  /commons/proper/vfs/trunk/examples/pom.xml ( 632815 )
  /commons/proper/vfs/trunk/pom.xml ( 632815 )
  /commons/proper/vfs/trunk/sandbox/pom.xml ( 632815 )

Changed: niallp @ Sun 2 Mar 2008 11:46:00 -0800
Comment: Add Issue Tracking and Download pages generated by commons-build-plugin
Files changed:
  /commons/proper/beanutils/trunk/xdocs/download_beanutils.xml ( 632817 )
  /commons/proper/beanutils/trunk/xdocs/issue-tracking.xml ( 632817 )
  /commons/proper/betwixt/trunk/xdocs/download_betwixt.xml ( 632817 )
  /commons/proper/betwixt/trunk/xdocs/issue-tracking.xml ( 632817 )
  /commons/proper/chain/trunk/xdocs/download_chain.xml ( 632817 )
  /commons/proper/chain/trunk/xdocs/issue-tracking.xml ( 632817 )
  /commons/proper/cli/trunk/xdocs/download_cli.xml ( 632817 )
  /commons/proper/cli/trunk/xdocs/issue-tracking.xml ( 632817 )
  /commons/proper/codec/trunk/xdocs/download_codec.xml ( 632817 )
  /commons/proper/codec/trunk/xdocs/issue-tracking.xml ( 632817 )
  /commons/proper/collections/trunk/xdocs/download_collections.xml ( 632817 )
  /commons/proper/collections/trunk/xdocs/issue-tracking.xml ( 632817 )
  /commons/proper/commons-parent/trunk/pom.xml ( 632817 )
  /commons/proper/configuration/trunk/xdocs/download_configuration.xml ( 632817 )
  /commons/proper/configuration/trunk/xdocs/issue-tracking.xml ( 632817 )
  /commons/proper/daemon/trunk/xdocs/download_daemon.xml ( 632817 )
  /commons/proper/daemon/trunk/xdocs/issue-tracking.xml ( 632817 )
  /commons/proper/dbcp/trunk/xdocs/download_dbcp.xml ( 632817 )
  /commons/proper/dbcp/trunk/xdocs/issue-tracking.xml ( 632817 )
  /commons/proper/dbutils/trunk/xdocs/download_dbutils.xml ( 632817 )
  /commons/proper/dbutils/trunk/xdocs/issue-tracking.xml ( 632817 )
  /commons/proper/digester/trunk/xdocs/download_digester.xml ( 632817 )
  /commons/proper/digester/trunk/xdocs/issue-tracking.xml ( 632817 )
  /commons/proper/discovery/trunk/xdocs/download_discovery.xml ( 632817 )
  /commons/proper/discovery/trunk/xdocs/issue-tracking.xml ( 632817 )
  /commons/proper/el/trunk/xdocs/download_el.xml ( 632817 )
  /commons/proper/el/trunk/xdocs/issue-tracking.xml ( 632817 )
  /commons/proper/email/trunk/xdocs/download_email.xml ( 632817 )
  /commons/proper/email/trunk/xdocs/issue-tracking.xml ( 632817 )
  /commons/proper/fileupload/trunk/xdocs/download_fileupload.xml ( 632817 )
  /commons/proper/fileupload/trunk/xdocs/issue-tracking.xml ( 632817 )
  /commons/proper/io/trunk/xdocs/download_io.xml ( 632817 )
  /commons/proper/io/trunk/xdocs/issue-tracking.xml ( 632817 )
  /commons/proper/jci/trunk/src/site/site.xml ( 632817 )
  /commons/proper/jci/trunk/src/site/xdoc/download_jci.xml ( 632817 )
  /commons/proper/jci/trunk/src/site/xdoc/issue-tracking.xml ( 632817 )
  /commons/proper/jexl/trunk/xdocs/download_jexl.xml ( 632817 )
  /commons/proper/jexl/trunk/xdocs/issue-tracking.xml ( 632817 )
  /commons/proper/jxpath/trunk/xdocs/download_jxpath.xml ( 632817 )
  /commons/proper/jxpath/trunk/xdocs/issue-tracking.xml ( 632817 )
  /commons/proper/lang/trunk/xdocs/download_lang.xml ( 632817 )
  /commons/proper/lang/trunk/xdocs/issue-tracking.xml ( 632817 )
  /commons/proper/launcher/trunk/xdocs/download_launcher.xml ( 632817 )
  /commons/proper/launcher/trunk/xdocs/issue-tracking.xml ( 632817 )
  /commons/proper/logging/trunk/src/site/site.xml ( 632817 )
  /commons/proper/logging/trunk/xdocs/download_logging.xml ( 632817 )
  /commons/proper/logging/trunk/xdocs/issue-tracking.xml ( 632817 )
  /commons/proper/math/trunk/src/site/xdoc/download_math.xml ( 632817 )
  /commons/proper/math/trunk/src/site/xdoc/issue-tracking.xml ( 632817 )
  /commons/proper/modeler/trunk/xdocs/download_modeler.xml ( 632817 )
  /commons/proper/modeler/trunk/xdocs/issue-tracking.xml ( 632817 )
  /commons/proper/net/trunk/xdocs/download_net.xml ( 632817 )
  /commons/proper/net/trunk/xdocs/issue-tracking.xml ( 632817 )
  /commons/proper/pool/trunk/xdocs/download_pool.xml ( 632817 )
  /commons/proper/pool/trunk/xdocs/issue-tracking.xml ( 632817 )
  /commons/proper/primitives/trunk/xdocs/download_primitives.xml ( 632817 )
  /commons/proper/primitives/trunk/xdocs/issue-tracking.xml ( 632817 )
  /commons/proper/proxy/trunk/src/site/site.xml ( 632817 )
  /commons/proper/proxy/trunk/src/site/xdoc/download_proxy.xml ( 632817 )
  /commons/proper/proxy/trunk/src/site/xdoc/issue-tracking.xml ( 632817 )
  /commons/proper/scxml/trunk/xdocs/download_scxml.xml ( 632817 )
  /commons/proper/scxml/trunk/xdocs/issue-tracking.xml ( 632817 )
  /commons/proper/transaction/trunk/xdocs/download_transaction.xml ( 632817 )
  /commons/proper/transaction/trunk/xdocs/issue-tracking.xml ( 632817 )
  /commons/proper/validator/trunk/xdocs/download_validator.xml ( 632817 )
  /commons/proper/validator/trunk/xdocs/issue-tracking.xml ( 632817 )
  /commons/proper/vfs/trunk/xdocs/download_vfs.xml ( 632817 )
  /commons/proper/vfs/trunk/xdocs/issue-tracking.xml ( 632817 )

****************************************************************************
Dependencies Changes:
****************************************************************************
No dependencies changed


****************************************************************************
Build Defintion:
****************************************************************************
POM filename: pom.xml
Goals: clean deploy   
Arguments: --batch-mode -DaltDeploymentRepository=vmbuild.repo::default::file://localhost/home/continuum/data/commons
-Pci
Build Fresh: false
Always Build: false
Default Build Definition: true
Schedule: COMMONS_SCHEDULE
Profile Name: Java 1.4
Description: 


****************************************************************************
Test Summary:
****************************************************************************
Tests: 374
Failures: 19
Total time: 23454

****************************************************************************
Output:
****************************************************************************
[INFO] Scanning for projects...
[INFO] ----------------------------------------------------------------------------
[INFO] Building Commons Validator
[INFO]    task-segment: [clean, deploy]
[INFO] ----------------------------------------------------------------------------
[INFO] [clean:clean]
[INFO] Deleting directory /home/continuum/data/working-directory/170/target
[INFO] Deleting directory /home/continuum/data/working-directory/170/target/classes
[INFO] Deleting directory /home/continuum/data/working-directory/170/target/test-classes
[INFO] Deleting directory /home/continuum/data/working-directory/170/target/site
[INFO] [antrun:run {execution: javadoc.resources}]
[INFO] Executing tasks
     [copy] Copying 2 files to /home/continuum/data/working-directory/170/target/apidocs/META-INF
[INFO] Executed tasks
[INFO] [antrun:run {execution: javascript.compress}]
[INFO] Executing tasks

compress:

compressor-specified:

download-compressor-check:

download-compressor:

compress-files:
     [echo] Compressing JavaScript files using lib/custom_rhino-0.4.3.jar
    [mkdir] Created dir: /home/continuum/data/working-directory/170/target/classes/org/apache/commons/validator/javascript
     [echo] Compressing commons-validator-1.4-SNAPSHOT.js

compress-file:
     [echo] Compressing validateByte.js

compress-file:
     [echo] Compressing validateCreditCard.js

compress-file:
     [echo] Compressing validateDate.js

compress-file:
     [echo] Compressing validateEmail.js

compress-file:
     [echo] Compressing validateFloat.js

compress-file:
     [echo] Compressing validateFloatRange.js

compress-file:
     [echo] Compressing validateInteger.js

compress-file:
     [echo] Compressing validateIntRange.js

compress-file:
     [echo] Compressing validateMask.js

compress-file:
     [echo] Compressing validateMaxLength.js

compress-file:
     [echo] Compressing validateMinLength.js

compress-file:
     [echo] Compressing validateRequired.js

compress-file:
     [echo] Compressing validateShort.js

compress-file:
     [echo] Compressing validateUtilities.js
[INFO] Executed tasks
[INFO] [resources:resources]
[INFO] Using default encoding to copy filtered resources.
[INFO] [compiler:compile]
[INFO] Compiling 54 source files to /home/continuum/data/working-directory/170/target/classes
[INFO] [resources:testResources]
[INFO] Using default encoding to copy filtered resources.
[INFO] [compiler:testCompile]
[INFO] Compiling 72 source files to /home/continuum/data/working-directory/170/target/test-classes
[INFO] [surefire:test]
[INFO] Surefire report directory: /home/continuum/data/working-directory/170/target/surefire-reports

-------------------------------------------------------
 T E S T S
-------------------------------------------------------
Running org.apache.commons.validator.RetrieveFormTest
Mar 2, 2008 12:28:07 PM org.apache.commons.validator.ValidatorResources getForm
WARNING: Form 'INVALID_NAME' not found for locale 'en_US'
Mar 2, 2008 12:28:07 PM org.apache.commons.validator.ValidatorResources getForm
WARNING: Form 'INVALID_NAME' not found for locale 'fr'
Mar 2, 2008 12:28:07 PM org.apache.commons.validator.ValidatorResources getForm
WARNING: Form 'INVALID_NAME' not found for locale 'fr_FR'
Mar 2, 2008 12:28:07 PM org.apache.commons.validator.ValidatorResources getForm
WARNING: Form 'INVALID_NAME' not found for locale 'en_CA'
Mar 2, 2008 12:28:07 PM org.apache.commons.validator.ValidatorResources getForm
WARNING: Form 'INVALID_NAME' not found for locale 'fr_CA'
Mar 2, 2008 12:28:07 PM org.apache.commons.validator.ValidatorResources getForm
WARNING: Form 'INVALID_NAME' not found for locale 'fr_CA_XXX'
Tests run: 5, Failures: 0, Errors: 0, Skipped: 0, Time elapsed: 0.605 sec
Running org.apache.commons.validator.util.FlagsTest
Tests run: 11, Failures: 0, Errors: 0, Skipped: 0, Time elapsed: 0.017 sec
Running org.apache.commons.validator.ByteTest
Tests run: 8, Failures: 0, Errors: 0, Skipped: 0, Time elapsed: 0.405 sec
Running org.apache.commons.validator.routines.CodeValidatorTest
Tests run: 5, Failures: 0, Errors: 0, Skipped: 0, Time elapsed: 0.027 sec
Running org.apache.commons.validator.FloatTest
Tests run: 6, Failures: 0, Errors: 0, Skipped: 0, Time elapsed: 0.175 sec
Running org.apache.commons.validator.ExtensionTest
Tests run: 8, Failures: 0, Errors: 0, Skipped: 0, Time elapsed: 0.233 sec
Running org.apache.commons.validator.routines.DoubleValidatorTest
Tests run: 11, Failures: 0, Errors: 0, Skipped: 0, Time elapsed: 0.036 sec
Running org.apache.commons.validator.RequiredIfTest
Tests run: 5, Failures: 0, Errors: 0, Skipped: 0, Time elapsed: 0.201 sec
Running org.apache.commons.validator.routines.RegexValidatorTest
Tests run: 7, Failures: 0, Errors: 0, Skipped: 0, Time elapsed: 0.011 sec
Running org.apache.commons.validator.ValidatorResultsTest
Tests run: 2, Failures: 0, Errors: 0, Skipped: 0, Time elapsed: 0.028 sec
Running org.apache.commons.validator.DateTest
Tests run: 2, Failures: 0, Errors: 0, Skipped: 0, Time elapsed: 0.033 sec
Running org.apache.commons.validator.ValidatorResourcesTest
Tests run: 1, Failures: 0, Errors: 0, Skipped: 0, Time elapsed: 0.01 sec
Running org.apache.commons.validator.ExceptionTest
Tests run: 1, Failures: 0, Errors: 0, Skipped: 0, Time elapsed: 0.025 sec
Running org.apache.commons.validator.CreditCardValidatorTest
Tests run: 2, Failures: 0, Errors: 0, Skipped: 0, Time elapsed: 0.01 sec
Running org.apache.commons.validator.routines.LongValidatorTest
Tests run: 11, Failures: 0, Errors: 0, Skipped: 0, Time elapsed: 0.019 sec
Running org.apache.commons.validator.routines.InetAddressValidatorTest
Tests run: 4, Failures: 0, Errors: 0, Skipped: 0, Time elapsed: 0.008 sec
Running org.apache.commons.validator.routines.UrlValidatorTest
Tests run: 7, Failures: 0, Errors: 0, Skipped: 0, Time elapsed: 1.709 sec
Running org.apache.commons.validator.ParameterTest
Tests run: 1, Failures: 0, Errors: 0, Skipped: 0, Time elapsed: 0.018 sec
Running org.apache.commons.validator.MultipleConfigFilesTest
Tests run: 5, Failures: 0, Errors: 0, Skipped: 0, Time elapsed: 0.177 sec
Running org.apache.commons.validator.VarTest
Tests run: 1, Failures: 0, Errors: 0, Skipped: 0, Time elapsed: 0.058 sec
Running org.apache.commons.validator.routines.IntegerValidatorTest
Tests run: 11, Failures: 0, Errors: 0, Skipped: 0, Time elapsed: 0.018 sec
Running org.apache.commons.validator.ISBNValidatorTest
Tests run: 1, Failures: 0, Errors: 0, Skipped: 0, Time elapsed: 0.006 sec
Running org.apache.commons.validator.ShortTest
Tests run: 6, Failures: 0, Errors: 0, Skipped: 0, Time elapsed: 0.203 sec
Running org.apache.commons.validator.routines.checkdigit.AbstractCheckDigitTest
Tests run: 6, Failures: 0, Errors: 6, Skipped: 0, Time elapsed: 0.03 sec <<< FAILURE!
Running org.apache.commons.validator.routines.checkdigit.ISBNCheckDigitTest
Tests run: 7, Failures: 0, Errors: 0, Skipped: 0, Time elapsed: 0.011 sec
Running org.apache.commons.validator.UrlTest
Tests run: 5, Failures: 0, Errors: 0, Skipped: 0, Time elapsed: 17.377 sec
Running org.apache.commons.validator.FieldTest
Tests run: 9, Failures: 0, Errors: 0, Skipped: 0, Time elapsed: 0.012 sec
Running org.apache.commons.validator.routines.checkdigit.LuhnCheckDigitTest
Tests run: 6, Failures: 0, Errors: 0, Skipped: 0, Time elapsed: 0.012 sec
Running org.apache.commons.validator.routines.CreditCardValidatorTest
Tests run: 14, Failures: 0, Errors: 0, Skipped: 0, Time elapsed: 0.019 sec
Running org.apache.commons.validator.routines.checkdigit.EAN13CheckDigitTest
Tests run: 6, Failures: 0, Errors: 0, Skipped: 0, Time elapsed: 0.005 sec
Running org.apache.commons.validator.routines.EmailValidatorTest
Tests run: 9, Failures: 0, Errors: 0, Skipped: 0, Time elapsed: 0.012 sec
Running org.apache.commons.validator.CustomValidatorResourcesTest
Tests run: 1, Failures: 0, Errors: 0, Skipped: 0, Time elapsed: 0.016 sec
Running org.apache.commons.validator.routines.ByteValidatorTest
Tests run: 11, Failures: 0, Errors: 0, Skipped: 0, Time elapsed: 0.099 sec
Running org.apache.commons.validator.routines.DateValidatorTest
Tests run: 7, Failures: 0, Errors: 0, Skipped: 0, Time elapsed: 0.099 sec
Running org.apache.commons.validator.routines.checkdigit.VerhoeffCheckDigitTest
Tests run: 6, Failures: 0, Errors: 0, Skipped: 0, Time elapsed: 0.01 sec
Running org.apache.commons.validator.routines.ISBNValidatorTest
Tests run: 12, Failures: 0, Errors: 0, Skipped: 0, Time elapsed: 0.014 sec
Running org.apache.commons.validator.LongTest
Tests run: 8, Failures: 0, Errors: 0, Skipped: 0, Time elapsed: 0.186 sec
Running org.apache.commons.validator.routines.ShortValidatorTest
Tests run: 11, Failures: 0, Errors: 0, Skipped: 0, Time elapsed: 0.067 sec
Running org.apache.commons.validator.LocaleTest
Tests run: 5, Failures: 0, Errors: 0, Skipped: 0, Time elapsed: 0.093 sec
Running org.apache.commons.validator.RequiredNameTest
Tests run: 6, Failures: 0, Errors: 0, Skipped: 0, Time elapsed: 0.199 sec
Running org.apache.commons.validator.routines.TimeValidatorTest
Tests run: 7, Failures: 0, Errors: 0, Skipped: 0, Time elapsed: 0.088 sec
Running org.apache.commons.validator.GenericValidatorTest
Tests run: 2, Failures: 0, Errors: 0, Skipped: 0, Time elapsed: 0.003 sec
Running org.apache.commons.validator.DoubleTest
Tests run: 6, Failures: 0, Errors: 0, Skipped: 0, Time elapsed: 0.123 sec
Running org.apache.commons.validator.routines.CurrencyValidatorTest
Tests run: 6, Failures: 0, Errors: 0, Skipped: 0, Time elapsed: 0.012 sec
Running org.apache.commons.validator.routines.AbstractCalendarValidatorTest
Tests run: 5, Failures: 0, Errors: 5, Skipped: 0, Time elapsed: 0.016 sec <<< FAILURE!
Running org.apache.commons.validator.GenericTypeValidatorTest
Tests run: 3, Failures: 0, Errors: 0, Skipped: 0, Time elapsed: 0.127 sec
Running org.apache.commons.validator.routines.CalendarValidatorTest
Tests run: 9, Failures: 0, Errors: 0, Skipped: 0, Time elapsed: 0.036 sec
Running org.apache.commons.validator.MultipleTest
Tests run: 8, Failures: 0, Errors: 0, Skipped: 0, Time elapsed: 0.241 sec
Running org.apache.commons.validator.routines.PercentValidatorTest
Tests run: 3, Failures: 0, Errors: 0, Skipped: 0, Time elapsed: 0.008 sec
Running org.apache.commons.validator.routines.FloatValidatorTest
Tests run: 12, Failures: 0, Errors: 0, Skipped: 0, Time elapsed: 0.02 sec
Running org.apache.commons.validator.routines.checkdigit.ISBN10CheckDigitTest
Tests run: 6, Failures: 0, Errors: 0, Skipped: 0, Time elapsed: 0.007 sec
Running org.apache.commons.validator.routines.BigDecimalValidatorTest
Tests run: 11, Failures: 0, Errors: 0, Skipped: 0, Time elapsed: 0.019 sec
Running org.apache.commons.validator.routines.BigIntegerValidatorTest
Tests run: 11, Failures: 0, Errors: 0, Skipped: 0, Time elapsed: 0.013 sec
Running org.apache.commons.validator.EntityImportTest
Tests run: 2, Failures: 0, Errors: 0, Skipped: 0, Time elapsed: 0.017 sec
Running org.apache.commons.validator.IntegerTest
Tests run: 8, Failures: 0, Errors: 0, Skipped: 0, Time elapsed: 0.292 sec
Running org.apache.commons.validator.routines.AbstractNumberValidatorTest
Tests run: 9, Failures: 0, Errors: 8, Skipped: 0, Time elapsed: 0.042 sec <<< FAILURE!
Running org.apache.commons.validator.EmailTest
Tests run: 9, Failures: 0, Errors: 0, Skipped: 0, Time elapsed: 0.224 sec
Running org.apache.commons.validator.routines.DomainValidatorTest
Tests run: 3, Failures: 0, Errors: 0, Skipped: 0, Time elapsed: 0.006 sec
Running org.apache.commons.validator.ValidatorTest
ValidatorTest.formatDate() - Unparseable date: "2/30/1999"
Tests run: 4, Failures: 0, Errors: 0, Skipped: 0, Time elapsed: 0.073 sec

Results :

Tests in error: 
  testIsValidTrue(org.apache.commons.validator.routines.checkdigit.AbstractCheckDigitTest)
  testIsValidFalse(org.apache.commons.validator.routines.checkdigit.AbstractCheckDigitTest)
  testCalculateValid(org.apache.commons.validator.routines.checkdigit.AbstractCheckDigitTest)
  testCalculateInvalid(org.apache.commons.validator.routines.checkdigit.AbstractCheckDigitTest)
  testMissingCode(org.apache.commons.validator.routines.checkdigit.AbstractCheckDigitTest)
  testZeroSum(org.apache.commons.validator.routines.checkdigit.AbstractCheckDigitTest)
  testPatternValid(org.apache.commons.validator.routines.AbstractCalendarValidatorTest)
  testPatternInvalid(org.apache.commons.validator.routines.AbstractCalendarValidatorTest)
  testLocaleValid(org.apache.commons.validator.routines.AbstractCalendarValidatorTest)
  testLocaleInvalid(org.apache.commons.validator.routines.AbstractCalendarValidatorTest)
  testFormat(org.apache.commons.validator.routines.AbstractCalendarValidatorTest)
  testFormat(org.apache.commons.validator.routines.AbstractNumberValidatorTest)
  testFormatType(org.apache.commons.validator.routines.AbstractNumberValidatorTest)
  testInvalidStrict(org.apache.commons.validator.routines.AbstractNumberValidatorTest)
  testInvalidNotStrict(org.apache.commons.validator.routines.AbstractNumberValidatorTest)
  testValidStrict(org.apache.commons.validator.routines.AbstractNumberValidatorTest)
  testValidNotStrict(org.apache.commons.validator.routines.AbstractNumberValidatorTest)
  testValidateLocale(org.apache.commons.validator.routines.AbstractNumberValidatorTest)
  testRangeMinMax(org.apache.commons.validator.routines.AbstractNumberValidatorTest)

Tests run: 374, Failures: 0, Errors: 19, Skipped: 0

[INFO] ------------------------------------------------------------------------
[ERROR] BUILD FAILURE
[INFO] ------------------------------------------------------------------------
[INFO] There are test failures.

Please refer to /home/continuum/data/working-directory/170/target/surefire-reports for the
individual test results.
[INFO] ------------------------------------------------------------------------
[INFO] For more information, run Maven with the -e switch
[INFO] ------------------------------------------------------------------------
[INFO] Total time: 48 seconds
[INFO] Finished at: Sun Mar 02 12:28:30 PST 2008
[INFO] Final Memory: 9M/24M
[INFO] ------------------------------------------------------------------------

****************************************************************************



---------------------------------------------------------------------
To unsubscribe, e-mail: dev-unsubscribe@commons.apache.org
For additional commands, e-mail: dev-help@commons.apache.org


Mime
View raw message