commons-dev mailing list archives

Site index · List index
Message view « Date » · « Thread »
Top « Date » · « Thread »
From Continuum VMBuild Server <contin...@apache.org>
Subject [continuum] BUILD FAILURE: Commons Codec
Date Sun, 09 Mar 2008 14:55:38 GMT
Online report : http://vmbuild.apache.org/continuum/buildResult.action?buildId=63107&projectId=159

Build statistics:
  State: Failed
  Previous State: Failed
  Started at: Sun 9 Mar 2008 07:54:58 -0700
  Finished at: Sun 9 Mar 2008 07:55:20 -0700
  Total time: 22s
  Build Trigger: Schedule
  Build Number: 6
  Exit code: 1
  Building machine hostname: vmbuild.apache.org
  Operating system : Linux(unknown)
  Java Home version : 
          java version "1.5.0_12"
          Java(TM) 2 Runtime Environment, Standard Edition (build 1.5.0_12-b04)
          Java HotSpot(TM) Client VM (build 1.5.0_12-b04, mixed mode, sharing)
        
  Builder version :
          Maven version: 2.0.7
          Java version: 1.5.0_12
          OS name: "linux" version: "2.6.20-16-server" arch: "i386"
    
****************************************************************************
SCM Changes:
****************************************************************************
Changed: niallp @ Sun 9 Mar 2008 07:21:48 -0700
Comment: Upgrade to version 9 of commons-parent
Files changed:
  /commons/proper/beanutils/trunk/pom.xml ( 635244 )
  /commons/proper/betwixt/trunk/pom.xml ( 635244 )
  /commons/proper/chain/trunk/pom.xml ( 635244 )
  /commons/proper/cli/trunk/pom.xml ( 635244 )
  /commons/proper/codec/trunk/pom.xml ( 635244 )
  /commons/proper/collections/trunk/pom.xml ( 635244 )
  /commons/proper/configuration/trunk/pom.xml ( 635244 )
  /commons/proper/daemon/trunk/pom.xml ( 635244 )
  /commons/proper/dbcp/trunk/pom.xml ( 635244 )
  /commons/proper/dbutils/trunk/pom.xml ( 635244 )
  /commons/proper/digester/trunk/pom.xml ( 635244 )
  /commons/proper/discovery/trunk/pom.xml ( 635244 )
  /commons/proper/el/trunk/pom.xml ( 635244 )
  /commons/proper/email/trunk/pom.xml ( 635244 )
  /commons/proper/fileupload/trunk/pom.xml ( 635244 )
  /commons/proper/io/trunk/pom.xml ( 635244 )
  /commons/proper/jci/trunk/compilers/eclipse/pom.xml ( 635244 )
  /commons/proper/jci/trunk/compilers/groovy/pom.xml ( 635244 )
  /commons/proper/jci/trunk/compilers/janino/pom.xml ( 635244 )
  /commons/proper/jci/trunk/compilers/javac/pom.xml ( 635244 )
  /commons/proper/jci/trunk/compilers/jsr199/pom.xml ( 635244 )
  /commons/proper/jci/trunk/compilers/rhino/pom.xml ( 635244 )
  /commons/proper/jci/trunk/core/pom.xml ( 635244 )
  /commons/proper/jci/trunk/examples/pom.xml ( 635244 )
  /commons/proper/jci/trunk/fam/pom.xml ( 635244 )
  /commons/proper/jci/trunk/pom.xml ( 635244 )
  /commons/proper/jexl/trunk/pom.xml ( 635244 )
  /commons/proper/jxpath/trunk/pom.xml ( 635244 )
  /commons/proper/lang/trunk/pom.xml ( 635244 )
  /commons/proper/launcher/trunk/pom.xml ( 635244 )
  /commons/proper/logging/trunk/pom.xml ( 635244 )
  /commons/proper/math/trunk/pom.xml ( 635244 )
  /commons/proper/modeler/trunk/pom.xml ( 635244 )
  /commons/proper/net/trunk/pom.xml ( 635244 )
  /commons/proper/pool/trunk/pom.xml ( 635244 )
  /commons/proper/primitives/trunk/pom.xml ( 635244 )
  /commons/proper/proxy/trunk/pom.xml ( 635244 )
  /commons/proper/scxml/trunk/pom.xml ( 635244 )
  /commons/proper/transaction/trunk/pom.xml ( 635244 )
  /commons/proper/validator/trunk/pom.xml ( 635244 )
  /commons/proper/vfs/trunk/core/pom.xml ( 635244 )
  /commons/proper/vfs/trunk/examples/pom.xml ( 635244 )
  /commons/proper/vfs/trunk/pom.xml ( 635244 )
  /commons/proper/vfs/trunk/sandbox/pom.xml ( 635244 )

****************************************************************************
Dependencies Changes:
****************************************************************************
No dependencies changed


****************************************************************************
Build Defintion:
****************************************************************************
POM filename: pom.xml
Goals: clean deploy   
Arguments: --batch-mode -DaltDeploymentRepository=vmbuild.repo::default::file://localhost/home/continuum/data/commons
-Pci
Build Fresh: false
Always Build: false
Default Build Definition: true
Schedule: COMMONS_SCHEDULE
Profile Name: Java 5
Description: 


****************************************************************************
Test Summary:
****************************************************************************
Tests: 201
Failures: 1
Total time: 1903

****************************************************************************
Output:
****************************************************************************
[INFO] Scanning for projects...
[INFO] ----------------------------------------------------------------------------
[INFO] Building Commons Codec
[INFO]    task-segment: [clean, deploy]
[INFO] ----------------------------------------------------------------------------
[INFO] [clean:clean]
[INFO] Deleting directory /home/continuum/data/working-directory/159/target
[INFO] Deleting directory /home/continuum/data/working-directory/159/target/classes
[INFO] Deleting directory /home/continuum/data/working-directory/159/target/test-classes
[INFO] Deleting directory /home/continuum/data/working-directory/159/target/site
[INFO] [antrun:run {execution: javadoc.resources}]
[INFO] Executing tasks
     [copy] Copying 2 files to /home/continuum/data/working-directory/159/target/apidocs/META-INF
[INFO] Executed tasks
[INFO] [resources:resources]
[INFO] Using default encoding to copy filtered resources.
[INFO] [compiler:compile]
[INFO] Compiling 25 source files to /home/continuum/data/working-directory/159/target/classes
[INFO] [bundle:manifest {execution: bundle-manifest}]
[INFO] [resources:testResources]
[INFO] Using default encoding to copy filtered resources.
[INFO] [compiler:testCompile]
[INFO] Compiling 18 source files to /home/continuum/data/working-directory/159/target/test-classes
[INFO] [surefire:test]
[INFO] Surefire report directory: /home/continuum/data/working-directory/159/target/surefire-reports

-------------------------------------------------------
 T E S T S
-------------------------------------------------------
Running org.apache.commons.codec.net.URLCodecTest
Tests run: 16, Failures: 0, Errors: 0, Skipped: 0, Time elapsed: 0.108 sec
Running org.apache.commons.codec.language.MetaphoneTest
Tests run: 33, Failures: 1, Errors: 0, Skipped: 0, Time elapsed: 0.105 sec <<< FAILURE!
Running org.apache.commons.codec.net.QuotedPrintableCodecTest
Tests run: 15, Failures: 0, Errors: 0, Skipped: 0, Time elapsed: 0.03 sec
Running org.apache.commons.codec.net.RFC1522CodecTest
Tests run: 2, Failures: 0, Errors: 0, Skipped: 0, Time elapsed: 0.009 sec
Running org.apache.commons.codec.net.QCodecTest
Tests run: 12, Failures: 0, Errors: 0, Skipped: 0, Time elapsed: 0.029 sec
Running org.apache.commons.codec.binary.HexTest
Tests run: 12, Failures: 0, Errors: 0, Skipped: 0, Time elapsed: 0.085 sec
Running org.apache.commons.codec.language.RefinedSoundexTest
Tests run: 6, Failures: 0, Errors: 0, Skipped: 0, Time elapsed: 0.011 sec
Running org.apache.commons.codec.binary.Base64Test
Tests run: 29, Failures: 0, Errors: 0, Skipped: 0, Time elapsed: 0.063 sec
Running org.apache.commons.codec.language.CaverphoneTest
Tests run: 4, Failures: 0, Errors: 0, Skipped: 0, Time elapsed: 0.033 sec
Running org.apache.commons.codec.digest.DigestUtilsTest
Tests run: 8, Failures: 0, Errors: 0, Skipped: 0, Time elapsed: 1.227 sec
Running org.apache.commons.codec.StringEncoderComparatorTest
Tests run: 4, Failures: 0, Errors: 0, Skipped: 0, Time elapsed: 0.024 sec
Running org.apache.commons.codec.language.SoundexTest
Tests run: 25, Failures: 0, Errors: 0, Skipped: 0, Time elapsed: 0.031 sec
Running org.apache.commons.codec.language.DoubleMetaphoneTest
Tests run: 13, Failures: 0, Errors: 0, Skipped: 0, Time elapsed: 0.18 sec
Running org.apache.commons.codec.net.BCodecTest
Tests run: 9, Failures: 0, Errors: 0, Skipped: 0, Time elapsed: 0.016 sec
Running org.apache.commons.codec.binary.BinaryCodecTest
Tests run: 13, Failures: 0, Errors: 0, Skipped: 0, Time elapsed: 0.02 sec

Results :

Failed tests: 
  testWhy(org.apache.commons.codec.language.MetaphoneTest)

Tests run: 201, Failures: 1, Errors: 0, Skipped: 0

[INFO] ------------------------------------------------------------------------
[ERROR] BUILD FAILURE
[INFO] ------------------------------------------------------------------------
[INFO] There are test failures.

Please refer to /home/continuum/data/working-directory/159/target/surefire-reports for the
individual test results.
[INFO] ------------------------------------------------------------------------
[INFO] For more information, run Maven with the -e switch
[INFO] ------------------------------------------------------------------------
[INFO] Total time: 14 seconds
[INFO] Finished at: Sun Mar 09 07:55:19 PDT 2008
[INFO] Final Memory: 12M/22M
[INFO] ------------------------------------------------------------------------

****************************************************************************



---------------------------------------------------------------------
To unsubscribe, e-mail: dev-unsubscribe@commons.apache.org
For additional commands, e-mail: dev-help@commons.apache.org


Mime
View raw message