commons-dev mailing list archives

Site index · List index
Message view « Date » · « Thread »
Top « Date » · « Thread »
From Continuum VMBuild Server <contin...@apache.org>
Subject [continuum] BUILD FAILURE: Commons Monitoring (Sandbox)
Date Sat, 08 Mar 2008 07:51:32 GMT
Online report : http://vmbuild.apache.org/continuum/buildResult.action?buildId=62754&projectId=538

Build statistics:
  State: Failed
  Previous Build: No previous build.
  Started at: Fri 7 Mar 2008 23:50:37 -0800
  Finished at: Fri 7 Mar 2008 23:51:14 -0800
  Total time: 36s
  Build Trigger: Forced
  Build Number: 0
  Exit code: 1
  Building machine hostname: vmbuild.apache.org
  Operating system : Linux(unknown)
  Java Home version : 
          java version "1.5.0_12"
          Java(TM) 2 Runtime Environment, Standard Edition (build 1.5.0_12-b04)
          Java HotSpot(TM) Client VM (build 1.5.0_12-b04, mixed mode, sharing)
        
  Builder version :
          Maven version: 2.0.7
          Java version: 1.5.0_12
          OS name: "linux" version: "2.6.20-16-server" arch: "i386"
    
****************************************************************************
SCM Changes:
****************************************************************************
No files changed

****************************************************************************
Dependencies Changes:
****************************************************************************
No dependencies changed


****************************************************************************
Build Defintion:
****************************************************************************
POM filename: pom.xml
Goals: clean deploy   
Arguments: --batch-mode -DaltDeploymentRepository=vmbuild.repo::default::file://localhost/home/continuum/data/commons
-Pci
Build Fresh: false
Always Build: false
Default Build Definition: true
Schedule: COMMONS_SCHEDULE
Profile Name: Java 5
Description: 


****************************************************************************
Test Summary:
****************************************************************************
Tests: 26
Failures: 7
Total time: 2861

****************************************************************************
Output:
****************************************************************************
[INFO] Scanning for projects...
[INFO] ----------------------------------------------------------------------------
[INFO] Building Commons Monitoring (Sandbox)
[INFO]    task-segment: [clean, deploy]
[INFO] ----------------------------------------------------------------------------
Downloading: http://repo1.maven.org/maven2/org/mortbay/jetty/maven-jetty-plugin/6.1.7/maven-jetty-plugin-6.1.7.pom
4K downloaded
Downloading: http://repo1.maven.org/maven2/org/mortbay/jetty/maven-jetty-plugin/6.1.7/maven-jetty-plugin-6.1.7.jar
37K downloaded
[INFO] [clean:clean]
[INFO] Deleting directory /home/continuum/data/working-directory/538/target
[INFO] Deleting directory /home/continuum/data/working-directory/538/target/classes
[INFO] Deleting directory /home/continuum/data/working-directory/538/target/test-classes
[INFO] Deleting directory /home/continuum/data/working-directory/538/target/site
Downloading: http://repo1.maven.org/maven2/org/apache/commons/commons-proxy/1.0/commons-proxy-1.0.pom
12K downloaded
Downloading: http://repo1.maven.org/maven2/org/apache/commons/commons-proxy/1.0/commons-proxy-1.0.jar
71K downloaded
Downloading: http://repo1.maven.org/maven2/net/sf/retrotranslator/retrotranslator-runtime/1.2.4/retrotranslator-runtime-1.2.4.pom
1K downloaded
Downloading: http://repo1.maven.org/maven2/net/sf/retrotranslator/retrotranslator-transformer/1.2.4/retrotranslator-transformer-1.2.4.pom
1K downloaded
Downloading: http://repo1.maven.org/maven2/net/sf/retrotranslator/retrotranslator-transformer/1.2.4/retrotranslator-transformer-1.2.4.jar
149K downloaded
Downloading: http://repo1.maven.org/maven2/net/sf/retrotranslator/retrotranslator-runtime/1.2.4/retrotranslator-runtime-1.2.4.jar
291K downloaded
[INFO] [antrun:run {execution: javadoc.resources}]
[INFO] Executing tasks
     [copy] Copying 2 files to /home/continuum/data/working-directory/538/target/apidocs/META-INF
[INFO] Executed tasks
[INFO] [resources:resources]
[INFO] Using default encoding to copy filtered resources.
[INFO] [compiler:compile]
[INFO] Compiling 58 source files to /home/continuum/data/working-directory/538/target/classes
[INFO] [resources:testResources]
[INFO] Using default encoding to copy filtered resources.
[INFO] [compiler:testCompile]
[INFO] Compiling 12 source files to /home/continuum/data/working-directory/538/target/test-classes
[INFO] [surefire:test]
[INFO] Surefire report directory: /home/continuum/data/working-directory/538/target/surefire-reports

-------------------------------------------------------
 T E S T S
-------------------------------------------------------
Running org.apache.commons.monitoring.impl.DefaultRepositoryTest
Tests run: 2, Failures: 2, Errors: 0, Skipped: 0, Time elapsed: 0.101 sec <<< FAILURE!
Running org.apache.commons.monitoring.impl.ThreadSafeCounterTest
Tests run: 2, Failures: 0, Errors: 0, Skipped: 0, Time elapsed: 0.017 sec
Running org.apache.commons.monitoring.UnitTest
Tests run: 1, Failures: 0, Errors: 0, Skipped: 0, Time elapsed: 0.008 sec
Running org.apache.commons.monitoring.StopWatchTest
paused after 1ns
running for 1ns
stoped after 2ns
Tests run: 2, Failures: 0, Errors: 0, Skipped: 0, Time elapsed: 0.014 sec
Running org.apache.commons.monitoring.MonitoringTest
500000 executions took 2614779000ns
Tests run: 2, Failures: 0, Errors: 0, Skipped: 0, Time elapsed: 2.634 sec
Running org.apache.commons.monitoring.listener.SecondaryReposioryTest
Tests run: 1, Failures: 0, Errors: 0, Skipped: 0, Time elapsed: 0.014 sec
Running org.apache.commons.monitoring.ExecutionStackTest
Tests run: 1, Failures: 0, Errors: 0, Skipped: 0, Time elapsed: 0.009 sec
Running org.apache.commons.monitoring.impl.CompositeValuesMonitorTest
Tests run: 3, Failures: 0, Errors: 0, Skipped: 0, Time elapsed: 0.009 sec
Running org.apache.commons.monitoring.reporting.SelectorTest
Tests run: 4, Failures: 0, Errors: 0, Skipped: 0, Time elapsed: 0.022 sec
Running org.apache.commons.monitoring.impl.ThreadSafeGaugeTest
Tests run: 2, Failures: 0, Errors: 0, Skipped: 0, Time elapsed: 0.007 sec
Running org.apache.commons.monitoring.reporting.RendererTest
Tests run: 5, Failures: 5, Errors: 0, Skipped: 0, Time elapsed: 0.078 sec <<< FAILURE!
Running org.apache.commons.monitoring.listener.ThresholdListenerTest
Tests run: 1, Failures: 0, Errors: 0, Skipped: 0, Time elapsed: 0.011 sec

Results :

Failed tests: 
  testCategories(org.apache.commons.monitoring.impl.DefaultRepositoryTest)
  testSubsystem(org.apache.commons.monitoring.impl.DefaultRepositoryTest)
  testRenderToJson(org.apache.commons.monitoring.reporting.RendererTest)
  testRenderToXml(org.apache.commons.monitoring.reporting.RendererTest)
  testRenderToTxt(org.apache.commons.monitoring.reporting.RendererTest)
  testRenderToHtml(org.apache.commons.monitoring.reporting.RendererTest)
  testOptions(org.apache.commons.monitoring.reporting.RendererTest)

Tests run: 26, Failures: 7, Errors: 0, Skipped: 0

[INFO] ------------------------------------------------------------------------
[ERROR] BUILD FAILURE
[INFO] ------------------------------------------------------------------------
[INFO] There are test failures.

Please refer to /home/continuum/data/working-directory/538/target/surefire-reports for the
individual test results.
[INFO] ------------------------------------------------------------------------
[INFO] For more information, run Maven with the -e switch
[INFO] ------------------------------------------------------------------------
[INFO] Total time: 23 seconds
[INFO] Finished at: Fri Mar 07 23:51:14 PST 2008
[INFO] Final Memory: 10M/19M
[INFO] ------------------------------------------------------------------------

****************************************************************************



---------------------------------------------------------------------
To unsubscribe, e-mail: dev-unsubscribe@commons.apache.org
For additional commands, e-mail: dev-help@commons.apache.org


Mime
View raw message